nixbot

builds

Mic92/nix-grpc-store build #558 failed

branch main · PR #142 · commit 46dbebe75c · · took 1m 46s · eval 17s

9 failed
failed attributes
status attribute duration
failed checks.aarch64-darwin.clang-tidy 1m 1s
nix-grpc-store-clang-tidy-0.1.0-beta.4: 179 | Emit && emit) -> bool | ^ ../src/daemon/log-spill.hh:195:16: error: 'wait_for' should be p …
nix-grpc-store-clang-tidy-0.1.0-beta.4:
  179 |     Emit && emit) -> bool
      |             ^
../src/daemon/log-spill.hh:195:16: error: 'wait_for' should be placed inside a while statement or used with a conditional parameter [bugprone-spuriously-wake-up-functions,cert-con36-c,cert-con54-cpp,-warnings-as-errors]
  195 |             cv.wait_for(lock, poll);
      |                ^
FAILED: [code=1] meson-internal__clang-tidy 
/nix/store/j2s018h6gc2q0z3sw002br2zas3m1l9d-meson-1.10.2/bin/meson --internal clangtidy /nix/var/nix/builds/nix-46934-3544683814/source /nix/var/nix/builds/nix-46934-3544683814/source/build --color always
ninja: build stopped: subcommand failed.
failed checks.aarch64-darwin.exit-stress 37s
nix-grpc-store-0.1.0-beta.4: [7/44] Compiling C++ object scheduler-test.p/tests_scheduler-test.cc.o [8/44] Precompiling header ../pch/client_pch.hh [9/44] Preco …
nix-grpc-store-0.1.0-beta.4:
[7/44] Compiling C++ object scheduler-test.p/tests_scheduler-test.cc.o
[8/44] Precompiling header ../pch/client_pch.hh
[9/44] Precompiling header ../pch/daemon_pch.hh
[10/44] Compiling C++ object libnix-grpc-dispatcher.a.p/src_daemon_dispatcher.cc.o
[11/44] Compiling C++ object dispatcher-bench.p/tests_dispatcher-bench.cc.o
[12/44] Compiling C++ object farm-client-test.p/tests_farm-client-test.cc.o
[13/44] Compiling C++ object oidc-test.p/tests_oidc-test.cc.o
ninja: build stopped: subcommand failed.
dependency failed checks.aarch64-darwin.nix-with-plugin —
dependency failed checks.aarch64-darwin.plugin-dispatcher —
failed checks.aarch64-darwin.plugin-nix_2_31 37s
nix-grpc-store-0.1.0-beta.4: [7/44] Precompiling header ../pch/client_pch.hh [8/44] Compiling C++ object scheduler-test.p/tests_scheduler-test.cc.o [9/44] Preco …
nix-grpc-store-0.1.0-beta.4:
[7/44] Precompiling header ../pch/client_pch.hh
[8/44] Compiling C++ object scheduler-test.p/tests_scheduler-test.cc.o
[9/44] Precompiling header ../pch/daemon_pch.hh
[10/44] Compiling C++ object farm-client-test.p/tests_farm-client-test.cc.o
[11/44] Compiling C++ object libnix-grpc-dispatcher.a.p/src_daemon_dispatcher.cc.o
[12/44] Compiling C++ object dispatcher-bench.p/tests_dispatcher-bench.cc.o
[13/44] Compiling C++ object oidc-test.p/tests_oidc-test.cc.o
ninja: build stopped: subcommand failed.
failed checks.aarch64-darwin.plugin-nix_2_34 37s
nix-grpc-store-0.1.0-beta.4: [7/44] Compiling C++ object scheduler-test.p/tests_scheduler-test.cc.o [8/44] Precompiling header ../pch/client_pch.hh [9/44] Preco …
nix-grpc-store-0.1.0-beta.4:
[7/44] Compiling C++ object scheduler-test.p/tests_scheduler-test.cc.o
[8/44] Precompiling header ../pch/client_pch.hh
[9/44] Precompiling header ../pch/daemon_pch.hh
[10/44] Compiling C++ object farm-client-test.p/tests_farm-client-test.cc.o
[11/44] Compiling C++ object libnix-grpc-dispatcher.a.p/src_daemon_dispatcher.cc.o
[12/44] Compiling C++ object dispatcher-bench.p/tests_dispatcher-bench.cc.o
[13/44] Compiling C++ object oidc-test.p/tests_oidc-test.cc.o
ninja: build stopped: subcommand failed.
failed checks.aarch64-darwin.plugin-nix_2_35 37s
nix-grpc-store-0.1.0-beta.4: [7/44] Compiling C++ object scheduler-test.p/tests_scheduler-test.cc.o [8/44] Precompiling header ../pch/client_pch.hh [9/44] Preco …
nix-grpc-store-0.1.0-beta.4:
[7/44] Compiling C++ object scheduler-test.p/tests_scheduler-test.cc.o
[8/44] Precompiling header ../pch/client_pch.hh
[9/44] Precompiling header ../pch/daemon_pch.hh
[10/44] Compiling C++ object libnix-grpc-dispatcher.a.p/src_daemon_dispatcher.cc.o
[11/44] Compiling C++ object farm-client-test.p/tests_farm-client-test.cc.o
[12/44] Compiling C++ object dispatcher-bench.p/tests_dispatcher-bench.cc.o
[13/44] Compiling C++ object oidc-test.p/tests_oidc-test.cc.o
ninja: build stopped: subcommand failed.
failed checks.aarch64-linux.clang-tidy 1m 15s
nix-grpc-store-clang-tidy-0.1.0-beta.4: 195 | cv.wait_for(lock, poll); | ^ ../src/daemon/main.cc:504:41: error: no header pro …
nix-grpc-store-clang-tidy-0.1.0-beta.4:
  195 |             cv.wait_for(lock, poll);
      |                ^
../src/daemon/main.cc:504:41: error: no header providing "nixgrpc::followSpill" is directly included [misc-include-cleaner,-warnings-as-errors]
   71 |         auto const completed = nixgrpc::followSpill(
      |                                         ^
FAILED: [code=1] meson-internal__clang-tidy 
/nix/store/sc7hggvmvma7m8bbgmp8gsa1q1x37aq8-meson-1.10.2/bin/meson --internal clangtidy /build/source /build/source/build --color always
ninja: build stopped: subcommand failed.
failed checks.x86_64-linux.clang-tidy 53s
nix-grpc-store-clang-tidy-0.1.0-beta.4: 195 | cv.wait_for(lock, poll); | ^ ../src/daemon/main.cc:504:41: error: no header pro …
nix-grpc-store-clang-tidy-0.1.0-beta.4:
  195 |             cv.wait_for(lock, poll);
      |                ^
../src/daemon/main.cc:504:41: error: no header providing "nixgrpc::followSpill" is directly included [misc-include-cleaner,-warnings-as-errors]
   71 |         auto const completed = nixgrpc::followSpill(
      |                                         ^
FAILED: [code=1] meson-internal__clang-tidy 
/nix/store/jaa89dphx07w3r26y7gh79a7b1mld5p4-meson-1.10.2/bin/meson --internal clangtidy /build/source /build/source/build --color always
ninja: build stopped: subcommand failed.
6 cancelled
cancelled attributes
status attribute duration
loading…
17 succeeded
succeeded attributes
status attribute duration
loading…
5 already built
skipped attributes
status attribute duration
loading…