nixbot

builds

Mic92/nix-grpc-store build #559 failed

branch main · PR #142 · commit dceff25bbb · · took 12m 3s · eval 17s

9 failed
failed attributes
status attribute duration
failed checks.aarch64-darwin.clang-tidy 1m 1s
nix-grpc-store-clang-tidy-0.1.0-beta.4: 580 | _LIBCPP_HIDE_FROM_ABI constexpr explicit expected(in_place_t, _Args&&... __args) noexcept( | …
nix-grpc-store-clang-tidy-0.1.0-beta.4:
  580 |   _LIBCPP_HIDE_FROM_ABI constexpr explicit expected(in_place_t, _Args&&... __args) noexcept(
      |                                            ^
/nix/store/9z187ss3liak3pngakax2ip7nb1dc7z5-libcxx-21.1.6+apple-sdk-26.5/include/c++/v1/__expected/expected.h:592:44: note: explicit constructor is not a candidate
  592 |   _LIBCPP_HIDE_FROM_ABI constexpr explicit expected(unexpect_t, _Args&&... __args) noexcept(
      |                                            ^
FAILED: [code=1] meson-internal__clang-tidy 
/nix/store/j2s018h6gc2q0z3sw002br2zas3m1l9d-meson-1.10.2/bin/meson --internal clangtidy /nix/var/nix/builds/nix-50839-4061795475/source /nix/var/nix/builds/nix-50839-4061795475/source/build --color always
ninja: build stopped: subcommand failed.
failed checks.aarch64-darwin.exit-stress 36s
nix-grpc-store-0.1.0-beta.4: [7/44] Compiling C++ object scheduler-test.p/tests_scheduler-test.cc.o [8/44] Precompiling header ../pch/client_pch.hh [9/44] Preco …
nix-grpc-store-0.1.0-beta.4:
[7/44] Compiling C++ object scheduler-test.p/tests_scheduler-test.cc.o
[8/44] Precompiling header ../pch/client_pch.hh
[9/44] Precompiling header ../pch/daemon_pch.hh
[10/44] Compiling C++ object libnix-grpc-dispatcher.a.p/src_daemon_dispatcher.cc.o
[11/44] Compiling C++ object farm-client-test.p/tests_farm-client-test.cc.o
[12/44] Compiling C++ object dispatcher-bench.p/tests_dispatcher-bench.cc.o
[13/44] Compiling C++ object oidc-test.p/tests_oidc-test.cc.o
ninja: build stopped: subcommand failed.
dependency failed checks.aarch64-darwin.nix-with-plugin —
dependency failed checks.aarch64-darwin.plugin-dispatcher —
failed checks.aarch64-darwin.plugin-nix_2_31 36s
nix-grpc-store-0.1.0-beta.4: [7/44] Precompiling header ../pch/client_pch.hh [8/44] Compiling C++ object scheduler-test.p/tests_scheduler-test.cc.o [9/44] Preco …
nix-grpc-store-0.1.0-beta.4:
[7/44] Precompiling header ../pch/client_pch.hh
[8/44] Compiling C++ object scheduler-test.p/tests_scheduler-test.cc.o
[9/44] Precompiling header ../pch/daemon_pch.hh
[10/44] Compiling C++ object farm-client-test.p/tests_farm-client-test.cc.o
[11/44] Compiling C++ object libnix-grpc-dispatcher.a.p/src_daemon_dispatcher.cc.o
[12/44] Compiling C++ object dispatcher-bench.p/tests_dispatcher-bench.cc.o
[13/44] Compiling C++ object oidc-test.p/tests_oidc-test.cc.o
ninja: build stopped: subcommand failed.
failed checks.aarch64-darwin.plugin-nix_2_34 36s
nix-grpc-store-0.1.0-beta.4: [7/44] Compiling C++ object scheduler-test.p/tests_scheduler-test.cc.o [8/44] Precompiling header ../pch/client_pch.hh [9/44] Preco …
nix-grpc-store-0.1.0-beta.4:
[7/44] Compiling C++ object scheduler-test.p/tests_scheduler-test.cc.o
[8/44] Precompiling header ../pch/client_pch.hh
[9/44] Precompiling header ../pch/daemon_pch.hh
[10/44] Compiling C++ object libnix-grpc-dispatcher.a.p/src_daemon_dispatcher.cc.o
[11/44] Compiling C++ object farm-client-test.p/tests_farm-client-test.cc.o
[12/44] Compiling C++ object dispatcher-bench.p/tests_dispatcher-bench.cc.o
[13/44] Compiling C++ object oidc-test.p/tests_oidc-test.cc.o
ninja: build stopped: subcommand failed.
failed checks.aarch64-darwin.plugin-nix_2_35 36s
nix-grpc-store-0.1.0-beta.4: [7/44] Compiling C++ object scheduler-test.p/tests_scheduler-test.cc.o [8/44] Precompiling header ../pch/client_pch.hh [9/44] Preco …
nix-grpc-store-0.1.0-beta.4:
[7/44] Compiling C++ object scheduler-test.p/tests_scheduler-test.cc.o
[8/44] Precompiling header ../pch/client_pch.hh
[9/44] Precompiling header ../pch/daemon_pch.hh
[10/44] Compiling C++ object libnix-grpc-dispatcher.a.p/src_daemon_dispatcher.cc.o
[11/44] Compiling C++ object farm-client-test.p/tests_farm-client-test.cc.o
[12/44] Compiling C++ object dispatcher-bench.p/tests_dispatcher-bench.cc.o
[13/44] Compiling C++ object oidc-test.p/tests_oidc-test.cc.o
ninja: build stopped: subcommand failed.
failed checks.aarch64-linux.clang-tidy 1m 15s
nix-grpc-store-clang-tidy-0.1.0-beta.4: 71 | static_assert(static_cast<int>(nixgrpc::SpillKind::line) == static_cast<int>(nixgrpc::BuildEvent::Kind::line)); …
nix-grpc-store-clang-tidy-0.1.0-beta.4:
   71 | static_assert(static_cast<int>(nixgrpc::SpillKind::line) == static_cast<int>(nixgrpc::BuildEvent::Kind::line));
      |                                         ^
../src/daemon/main.cc:507:41: error: no header providing "nixgrpc::followSpill" is directly included [misc-include-cleaner,-warnings-as-errors]
  507 |         auto const completed = nixgrpc::followSpill(
      |                                         ^
FAILED: [code=1] meson-internal__clang-tidy 
/nix/store/sc7hggvmvma7m8bbgmp8gsa1q1x37aq8-meson-1.10.2/bin/meson --internal clangtidy /build/source /build/source/build --color always
ninja: build stopped: subcommand failed.
failed checks.x86_64-linux.clang-tidy 55s
nix-grpc-store-clang-tidy-0.1.0-beta.4: 71 | static_assert(static_cast<int>(nixgrpc::SpillKind::line) == static_cast<int>(nixgrpc::BuildEvent::Kind::line)); …
nix-grpc-store-clang-tidy-0.1.0-beta.4:
   71 | static_assert(static_cast<int>(nixgrpc::SpillKind::line) == static_cast<int>(nixgrpc::BuildEvent::Kind::line));
      |                                         ^
../src/daemon/main.cc:507:41: error: no header providing "nixgrpc::followSpill" is directly included [misc-include-cleaner,-warnings-as-errors]
  507 |         auto const completed = nixgrpc::followSpill(
      |                                         ^
FAILED: [code=1] meson-internal__clang-tidy 
/nix/store/jaa89dphx07w3r26y7gh79a7b1mld5p4-meson-1.10.2/bin/meson --internal clangtidy /build/source /build/source/build --color always
ninja: build stopped: subcommand failed.
23 succeeded
succeeded attributes
status attribute duration
loading…
5 already built
skipped attributes
status attribute duration
loading…