nixbot

builds

Mic92/nix-grpc-store build #611 failed

branch main · PR #178 · commit 90203450fd · · took 1m 50s · eval 19s

30 failed
failed attributes
status attribute duration
failed checks.aarch64-darwin.clang-tidy 1m 11s
nix-grpc-store-clang-tidy-0.1.0: Errors encountered while running clang-tidy ../src/client/channel.hh:55:22: error: method 'finish' can be made static [readabil …
nix-grpc-store-clang-tidy-0.1.0:
Errors encountered while running clang-tidy
../src/client/channel.hh:55:22: error: method 'finish' can be made static [readability-convert-member-functions-to-static,-warnings-as-errors]
   55 |   [[nodiscard]] auto finish(grpc::Status status) const -> grpc::Status
      |                      ^                           ~~~~~
      |   static 
FAILED: [code=1] meson-internal__clang-tidy 
/nix/store/j2s018h6gc2q0z3sw002br2zas3m1l9d-meson-1.10.2/bin/meson --internal clangtidy /nix/var/nix/builds/nix-48651-3585099551/source /nix/var/nix/builds/nix-48651-3585099551/source/build --color always
ninja: build stopped: subcommand failed.
dependency failed checks.aarch64-darwin.nix-tools-with-plugin —
dependency failed checks.aarch64-darwin.nix-with-plugin —
dependency failed checks.aarch64-darwin.plugin-dispatcher —
failed checks.aarch64-darwin.plugin-nix_2_31 22s
nix-grpc-store-plugin-0.1.0: 218 | auto const forget = nix::Finally([&] -> void { | ^ ~~~~~~~ /nix/store/xgximwxz …
nix-grpc-store-plugin-0.1.0:
  218 |         auto const forget = nix::Finally([&] -> void {
      |                             ^    ~~~~~~~
/nix/store/xgximwxzff7na03lcrf8zxg06mx27wif-nix-util-2.31.5+1-dev/include/nix/util/finally.hh:12:52: note: 'Finally' declared here
   12 | class [[nodiscard("Finally values must be used")]] Finally
      |                                                    ^
1 error generated.
[10/11] Compiling C++ object nix-grpc-store.dylib.p/meson-generated_.._nix_remote.grpc.pb.cc.o
ninja: build stopped: subcommand failed.
failed checks.aarch64-darwin.plugin-nix_2_34 23s
nix-grpc-store-plugin-0.1.0: 218 | auto const forget = nix::Finally([&] -> void { | ^ ~~~~~~~ /nix/store/6smk089g …
nix-grpc-store-plugin-0.1.0:
  218 |         auto const forget = nix::Finally([&] -> void {
      |                             ^    ~~~~~~~
/nix/store/6smk089g3r7ddfpxm1k5fxvh6yr55b3s-nix-util-2.34.8-dev/include/nix/util/finally.hh:12:52: note: 'Finally' declared here
   12 | class [[nodiscard("Finally values must be used")]] Finally
      |                                                    ^
1 error generated.
[10/11] Compiling C++ object nix-grpc-store.dylib.p/meson-generated_.._nix_remote.grpc.pb.cc.o
ninja: build stopped: subcommand failed.
failed checks.aarch64-darwin.plugin-nix_2_35 23s
nix-grpc-store-plugin-0.1.0: 218 | auto const forget = nix::Finally([&] -> void { | ^ ~~~~~~~ /nix/store/9300xxl8 …
nix-grpc-store-plugin-0.1.0:
  218 |         auto const forget = nix::Finally([&] -> void {
      |                             ^    ~~~~~~~
/nix/store/9300xxl8z69wsfy89xq0058bl6gak7bd-nix-util-2.35.2-dev/include/nix/util/finally.hh:12:52: note: 'Finally' declared here
   12 | class [[nodiscard("Finally values must be used")]] Finally
      |                                                    ^
1 error generated.
[10/11] Compiling C++ object nix-grpc-store.dylib.p/meson-generated_.._nix_remote.grpc.pb.cc.o
ninja: build stopped: subcommand failed.
dependency failed checks.aarch64-linux.acme-vm —
failed checks.aarch64-linux.clang-tidy 1m 14s
nix-grpc-store-clang-tidy-0.1.0: Errors encountered while running clang-tidy ../src/client/channel.hh:55:22: error: method 'finish' can be made static [readabil …
nix-grpc-store-clang-tidy-0.1.0:
Errors encountered while running clang-tidy
../src/client/channel.hh:55:22: error: method 'finish' can be made static [readability-convert-member-functions-to-static,-warnings-as-errors]
   55 |   [[nodiscard]] auto finish(grpc::Status status) const -> grpc::Status
      |                      ^                           ~~~~~
      |   static 
FAILED: [code=1] meson-internal__clang-tidy 
/nix/store/sc7hggvmvma7m8bbgmp8gsa1q1x37aq8-meson-1.10.2/bin/meson --internal clangtidy /build/source /build/source/build --color always
ninja: build stopped: subcommand failed.
dependency failed checks.aarch64-linux.farm —
dependency failed checks.aarch64-linux.nix-tools-with-plugin —
dependency failed checks.aarch64-linux.nix-with-plugin —
dependency failed checks.aarch64-linux.plugin-dispatcher —
failed checks.aarch64-linux.plugin-nix_2_31 24s
nix-grpc-store-plugin-0.1.0: | ^ ~~~~~~~ /nix/store/j5cfmpqdlhrqpfawazmy3wgdmr6jqjjs-nix-util-2.31.5-dev/include/nix/util/f …
nix-grpc-store-plugin-0.1.0:
      |                             ^    ~~~~~~~
/nix/store/j5cfmpqdlhrqpfawazmy3wgdmr6jqjjs-nix-util-2.31.5-dev/include/nix/util/finally.hh:12:52: note: 'Finally' declared here
   12 | class [[nodiscard("Finally values must be used")]] Finally
      |                                                    ^
1 error generated.
[9/11] Compiling C++ object nix-grpc-store.so.p/meson-generated_.._nix_remote.pb.cc.o
[10/11] Compiling C++ object nix-grpc-store.so.p/meson-generated_.._nix_remote.grpc.pb.cc.o
ninja: build stopped: subcommand failed.
failed checks.aarch64-linux.plugin-nix_2_34 25s
nix-grpc-store-plugin-0.1.0: 218 | auto const forget = nix::Finally([&] -> void { | ^ ~~~~~~~ /nix/store/jznvjrlv …
nix-grpc-store-plugin-0.1.0:
  218 |         auto const forget = nix::Finally([&] -> void {
      |                             ^    ~~~~~~~
/nix/store/jznvjrlvw54iaffjir64cl5w2ixl3r71-nix-util-2.34.8-dev/include/nix/util/finally.hh:12:52: note: 'Finally' declared here
   12 | class [[nodiscard("Finally values must be used")]] Finally
      |                                                    ^
1 error generated.
[10/11] Compiling C++ object nix-grpc-store.so.p/meson-generated_.._nix_remote.grpc.pb.cc.o
ninja: build stopped: subcommand failed.
failed checks.aarch64-linux.plugin-nix_2_35 25s
nix-grpc-store-plugin-0.1.0: 218 | auto const forget = nix::Finally([&] -> void { | ^ ~~~~~~~ /nix/store/ir01jdid …
nix-grpc-store-plugin-0.1.0:
  218 |         auto const forget = nix::Finally([&] -> void {
      |                             ^    ~~~~~~~
/nix/store/ir01jdid7nzrgfi9icksfd1wypsq0yj7-nix-util-2.35.2-dev/include/nix/util/finally.hh:12:52: note: 'Finally' declared here
   12 | class [[nodiscard("Finally values must be used")]] Finally
      |                                                    ^
1 error generated.
[10/11] Compiling C++ object nix-grpc-store.so.p/meson-generated_.._nix_remote.grpc.pb.cc.o
ninja: build stopped: subcommand failed.
dependency failed checks.aarch64-linux.vm —
dependency failed checks.aarch64-linux.vm-upload —
dependency failed checks.x86_64-linux.acme-vm —
failed checks.x86_64-linux.clang-tidy 55s
nix-grpc-store-clang-tidy-0.1.0: Errors encountered while running clang-tidy ../src/client/channel.hh:55:22: error: method 'finish' can be made static [readabil …
nix-grpc-store-clang-tidy-0.1.0:
Errors encountered while running clang-tidy
../src/client/channel.hh:55:22: error: method 'finish' can be made static [readability-convert-member-functions-to-static,-warnings-as-errors]
   55 |   [[nodiscard]] auto finish(grpc::Status status) const -> grpc::Status
      |                      ^                           ~~~~~
      |   static 
FAILED: [code=1] meson-internal__clang-tidy 
/nix/store/jaa89dphx07w3r26y7gh79a7b1mld5p4-meson-1.10.2/bin/meson --internal clangtidy /build/source /build/source/build --color always
ninja: build stopped: subcommand failed.
dependency failed checks.x86_64-linux.farm —
dependency failed checks.x86_64-linux.k3s —
dependency failed checks.x86_64-linux.nix-tools-with-plugin —
dependency failed checks.x86_64-linux.nix-with-plugin —
dependency failed checks.x86_64-linux.plugin-dispatcher —
failed checks.x86_64-linux.plugin-nix_2_31 17s
nix-grpc-store-plugin-0.1.0: 218 | auto const forget = nix::Finally([&] -> void { | ^ ~~~~~~~ /nix/store/qmahmdbq …
nix-grpc-store-plugin-0.1.0:
  218 |         auto const forget = nix::Finally([&] -> void {
      |                             ^    ~~~~~~~
/nix/store/qmahmdbq6rcwpcr8ixcprzq676yszkbr-nix-util-2.31.5-dev/include/nix/util/finally.hh:12:52: note: 'Finally' declared here
   12 | class [[nodiscard("Finally values must be used")]] Finally
      |                                                    ^
1 error generated.
[10/11] Compiling C++ object nix-grpc-store.so.p/meson-generated_.._nix_remote.grpc.pb.cc.o
ninja: build stopped: subcommand failed.
failed checks.x86_64-linux.plugin-nix_2_34 18s
nix-grpc-store-plugin-0.1.0: 218 | auto const forget = nix::Finally([&] -> void { | ^ ~~~~~~~ /nix/store/kn5a85s0 …
nix-grpc-store-plugin-0.1.0:
  218 |         auto const forget = nix::Finally([&] -> void {
      |                             ^    ~~~~~~~
/nix/store/kn5a85s018r96dnhnnmnayyfcj375adv-nix-util-2.34.8-dev/include/nix/util/finally.hh:12:52: note: 'Finally' declared here
   12 | class [[nodiscard("Finally values must be used")]] Finally
      |                                                    ^
1 error generated.
[10/11] Compiling C++ object nix-grpc-store.so.p/meson-generated_.._nix_remote.grpc.pb.cc.o
ninja: build stopped: subcommand failed.
failed checks.x86_64-linux.plugin-nix_2_35 17s
nix-grpc-store-plugin-0.1.0: 218 | auto const forget = nix::Finally([&] -> void { | ^ ~~~~~~~ /nix/store/aw9gmpj6 …
nix-grpc-store-plugin-0.1.0:
  218 |         auto const forget = nix::Finally([&] -> void {
      |                             ^    ~~~~~~~
/nix/store/aw9gmpj62dccndf72qdh3qhv6mzqdyap-nix-util-2.35.2-dev/include/nix/util/finally.hh:12:52: note: 'Finally' declared here
   12 | class [[nodiscard("Finally values must be used")]] Finally
      |                                                    ^
1 error generated.
[10/11] Compiling C++ object nix-grpc-store.so.p/meson-generated_.._nix_remote.grpc.pb.cc.o
ninja: build stopped: subcommand failed.
dependency failed checks.x86_64-linux.vm —
dependency failed checks.x86_64-linux.vm-upload —
7 succeeded
succeeded attributes
status attribute duration
loading…
5 already built
skipped attributes
status attribute duration
loading…