nixbot

builds

Mic92/nix-grpc-store build #612 failed

branch main · PR #178 · commit 6b43343276 · · took 1m 19s · eval 20s

37 failed
failed attributes
status attribute duration
failed checks.aarch64-darwin.clang-tidy 1m 10s
nix-grpc-store-clang-tidy-0.1.0: Errors encountered while running clang-tidy ../src/client/transfer.cc:19:1: error: included header client_interceptor.h is not …
nix-grpc-store-clang-tidy-0.1.0:
Errors encountered while running clang-tidy
../src/client/transfer.cc:19:1: error: included header client_interceptor.h is not used directly [misc-include-cleaner,-warnings-as-errors]
   19 | #include <grpcpp/support/client_interceptor.h>
      | ^~~~~~~~~~~~~~~~~~~~~~~~~~~~~~~~~~~~~~~~~~~~~~
   20 | #include <grpcpp/support/status.h>
FAILED: [code=1] meson-internal__clang-tidy 
/nix/store/j2s018h6gc2q0z3sw002br2zas3m1l9d-meson-1.10.2/bin/meson --internal clangtidy /nix/var/nix/builds/nix-54836-1400755263/source /nix/var/nix/builds/nix-54836-1400755263/source/build --color always
ninja: build stopped: subcommand failed.
failed checks.aarch64-darwin.exit-stress 47s
nix-grpc-store-0.1.0: 108 | , callback(createInterruptCallback([&]() { pthread_kill(target, NIX_SIG_MULTI_INT); })) | ^~~~~~~ …
nix-grpc-store-0.1.0:
  108 |         , callback(createInterruptCallback([&]() { pthread_kill(target, NIX_SIG_MULTI_INT); }))
      |                    ^~~~~~~~~~~~~~~~~~~~~~~
3 errors generated.
[52/58] Compiling C++ object nar-fetcher-test.p/tests_nar-fetcher-test.cc.o
[53/58] Compiling C++ object nix-grpc-daemon.p/src_daemon_coordinator.cc.o
[54/58] Compiling C++ object call-test.p/meson-generated_.._nix_remote.grpc.pb.cc.o
[55/58] Compiling C++ object nix-grpc-daemon.p/src_daemon_main.cc.o
ninja: build stopped: subcommand failed.
dependency failed checks.aarch64-darwin.nix-tools-with-plugin —
dependency failed checks.aarch64-darwin.nix-with-plugin —
dependency failed checks.aarch64-darwin.plugin-dispatcher —
failed checks.aarch64-darwin.plugin-nix_2_31 20s
nix-grpc-store-plugin-0.1.0: 218 | auto const forget = nix::Finally([&] -> void { | ^ ~~~~~~~ /nix/store/xgximwxz …
nix-grpc-store-plugin-0.1.0:
  218 |         auto const forget = nix::Finally([&] -> void {
      |                             ^    ~~~~~~~
/nix/store/xgximwxzff7na03lcrf8zxg06mx27wif-nix-util-2.31.5+1-dev/include/nix/util/finally.hh:12:52: note: 'Finally' declared here
   12 | class [[nodiscard("Finally values must be used")]] Finally
      |                                                    ^
1 error generated.
[10/11] Compiling C++ object nix-grpc-store.dylib.p/meson-generated_.._nix_remote.grpc.pb.cc.o
ninja: build stopped: subcommand failed.
failed checks.aarch64-darwin.plugin-nix_2_34 22s
nix-grpc-store-plugin-0.1.0: 218 | auto const forget = nix::Finally([&] -> void { | ^ ~~~~~~~ /nix/store/6smk089g …
nix-grpc-store-plugin-0.1.0:
  218 |         auto const forget = nix::Finally([&] -> void {
      |                             ^    ~~~~~~~
/nix/store/6smk089g3r7ddfpxm1k5fxvh6yr55b3s-nix-util-2.34.8-dev/include/nix/util/finally.hh:12:52: note: 'Finally' declared here
   12 | class [[nodiscard("Finally values must be used")]] Finally
      |                                                    ^
1 error generated.
[10/11] Compiling C++ object nix-grpc-store.dylib.p/meson-generated_.._nix_remote.grpc.pb.cc.o
ninja: build stopped: subcommand failed.
failed checks.aarch64-darwin.plugin-nix_2_35 23s
nix-grpc-store-plugin-0.1.0: 218 | auto const forget = nix::Finally([&] -> void { | ^ ~~~~~~~ /nix/store/9300xxl8 …
nix-grpc-store-plugin-0.1.0:
  218 |         auto const forget = nix::Finally([&] -> void {
      |                             ^    ~~~~~~~
/nix/store/9300xxl8z69wsfy89xq0058bl6gak7bd-nix-util-2.35.2-dev/include/nix/util/finally.hh:12:52: note: 'Finally' declared here
   12 | class [[nodiscard("Finally values must be used")]] Finally
      |                                                    ^
1 error generated.
[10/11] Compiling C++ object nix-grpc-store.dylib.p/meson-generated_.._nix_remote.grpc.pb.cc.o
ninja: build stopped: subcommand failed.
dependency failed checks.aarch64-linux.acme-vm —
failed checks.aarch64-linux.clang-tidy 1m 11s
nix-grpc-store-clang-tidy-0.1.0: Errors encountered while running clang-tidy ../src/client/transfer.cc:19:1: error: included header client_interceptor.h is not …
nix-grpc-store-clang-tidy-0.1.0:
Errors encountered while running clang-tidy
../src/client/transfer.cc:19:1: error: included header client_interceptor.h is not used directly [misc-include-cleaner,-warnings-as-errors]
   19 | #include <grpcpp/support/client_interceptor.h>
      | ^~~~~~~~~~~~~~~~~~~~~~~~~~~~~~~~~~~~~~~~~~~~~~
   20 | #include <grpcpp/support/status.h>
FAILED: [code=1] meson-internal__clang-tidy 
/nix/store/sc7hggvmvma7m8bbgmp8gsa1q1x37aq8-meson-1.10.2/bin/meson --internal clangtidy /build/source /build/source/build --color always
ninja: build stopped: subcommand failed.
failed checks.aarch64-linux.exit-stress 32s
nix-grpc-store-0.1.0: [24/58] Compiling C++ object call-test.p/meson-generated_.._nix_remote.grpc.pb.cc.o [25/58] Compiling C++ object nar-fetcher-test.p/meson- …
nix-grpc-store-0.1.0:
[24/58] Compiling C++ object call-test.p/meson-generated_.._nix_remote.grpc.pb.cc.o
[25/58] Compiling C++ object nar-fetcher-test.p/meson-generated_.._nix_remote.grpc.pb.cc.o
[26/58] Compiling C++ object libnix-grpc-dispatcher.a.p/src_daemon_dispatcher.cc.o
[27/58] Compiling C++ object scheduler-grpc-bench.p/meson-generated_.._nix_remote.grpc.pb.cc.o
[28/58] Compiling C++ object farm-client-test.p/tests_farm-client-test.cc.o
[29/58] Compiling C++ object scheduler-grpc-bench.p/tests_scheduler-grpc-bench.cc.o
[30/58] Compiling C++ object oidc-test.p/tests_oidc-test.cc.o
ninja: build stopped: subcommand failed.
dependency failed checks.aarch64-linux.farm —
failed checks.aarch64-linux.fuzz 35s
nix-grpc-store-fuzzers-0.1.0: [33/102] Compiling C++ object fuzz-build-log.p/fuzz_build-log.cc.o [34/102] Compiling C++ object fuzz-zstd-reader.p/meson-generate …
nix-grpc-store-fuzzers-0.1.0:
[33/102] Compiling C++ object fuzz-build-log.p/fuzz_build-log.cc.o
[34/102] Compiling C++ object fuzz-zstd-reader.p/meson-generated_.._nix_remote.grpc.pb.cc.o
[35/102] Compiling C++ object fuzz-build-log.p/meson-generated_.._nix_remote.pb.cc.o
[36/102] Compiling C++ object fuzz-tunnel-pump.p/meson-generated_.._nix_remote.grpc.pb.cc.o
[37/102] Compiling C++ object fuzz-import-paths.p/fuzz_import-paths.cc.o
[38/102] Compiling C++ object fuzz-import-paths.p/meson-generated_.._nix_remote.grpc.pb.cc.o
[39/102] Compiling C++ object fuzz-build-log.p/meson-generated_.._nix_remote.grpc.pb.cc.o
ninja: build stopped: subcommand failed.
dependency failed checks.aarch64-linux.nix-tools-with-plugin —
dependency failed checks.aarch64-linux.nix-with-plugin —
dependency failed checks.aarch64-linux.plugin-dispatcher —
failed checks.aarch64-linux.plugin-nix_2_31 24s
nix-grpc-store-plugin-0.1.0: | ^ ~~~~~~~ /nix/store/j5cfmpqdlhrqpfawazmy3wgdmr6jqjjs-nix-util-2.31.5-dev/include/nix/util/f …
nix-grpc-store-plugin-0.1.0:
      |                             ^    ~~~~~~~
/nix/store/j5cfmpqdlhrqpfawazmy3wgdmr6jqjjs-nix-util-2.31.5-dev/include/nix/util/finally.hh:12:52: note: 'Finally' declared here
   12 | class [[nodiscard("Finally values must be used")]] Finally
      |                                                    ^
1 error generated.
[9/11] Compiling C++ object nix-grpc-store.so.p/meson-generated_.._nix_remote.pb.cc.o
[10/11] Compiling C++ object nix-grpc-store.so.p/meson-generated_.._nix_remote.grpc.pb.cc.o
ninja: build stopped: subcommand failed.
failed checks.aarch64-linux.plugin-nix_2_34 24s
nix-grpc-store-plugin-0.1.0: | ^ ~~~~~~~ /nix/store/jznvjrlvw54iaffjir64cl5w2ixl3r71-nix-util-2.34.8-dev/include/nix/util/f …
nix-grpc-store-plugin-0.1.0:
      |                             ^    ~~~~~~~
/nix/store/jznvjrlvw54iaffjir64cl5w2ixl3r71-nix-util-2.34.8-dev/include/nix/util/finally.hh:12:52: note: 'Finally' declared here
   12 | class [[nodiscard("Finally values must be used")]] Finally
      |                                                    ^
1 error generated.
[9/11] Compiling C++ object nix-grpc-store.so.p/meson-generated_.._nix_remote.pb.cc.o
[10/11] Compiling C++ object nix-grpc-store.so.p/meson-generated_.._nix_remote.grpc.pb.cc.o
ninja: build stopped: subcommand failed.
failed checks.aarch64-linux.plugin-nix_2_35 25s
nix-grpc-store-plugin-0.1.0: 218 | auto const forget = nix::Finally([&] -> void { | ^ ~~~~~~~ /nix/store/ir01jdid …
nix-grpc-store-plugin-0.1.0:
  218 |         auto const forget = nix::Finally([&] -> void {
      |                             ^    ~~~~~~~
/nix/store/ir01jdid7nzrgfi9icksfd1wypsq0yj7-nix-util-2.35.2-dev/include/nix/util/finally.hh:12:52: note: 'Finally' declared here
   12 | class [[nodiscard("Finally values must be used")]] Finally
      |                                                    ^
1 error generated.
[10/11] Compiling C++ object nix-grpc-store.so.p/meson-generated_.._nix_remote.grpc.pb.cc.o
ninja: build stopped: subcommand failed.
failed checks.aarch64-linux.sanitize-smoke 28s
nix-grpc-store-asan-0.1.0: [24/58] Compiling C++ object call-test.p/meson-generated_.._nix_remote.grpc.pb.cc.o [25/58] Compiling C++ object scheduler-grpc-bench …
nix-grpc-store-asan-0.1.0:
[24/58] Compiling C++ object call-test.p/meson-generated_.._nix_remote.grpc.pb.cc.o
[25/58] Compiling C++ object scheduler-grpc-bench.p/meson-generated_.._nix_remote.grpc.pb.cc.o
[26/58] Compiling C++ object nar-fetcher-test.p/meson-generated_.._nix_remote.grpc.pb.cc.o
[27/58] Compiling C++ object farm-client-test.p/tests_farm-client-test.cc.o
[28/58] Compiling C++ object libnix-grpc-dispatcher.a.p/src_daemon_dispatcher.cc.o
[29/58] Compiling C++ object scheduler-grpc-bench.p/tests_scheduler-grpc-bench.cc.o
[30/58] Compiling C++ object oidc-test.p/tests_oidc-test.cc.o
ninja: build stopped: subcommand failed.
dependency failed checks.aarch64-linux.vm —
dependency failed checks.aarch64-linux.vm-upload —
dependency failed checks.x86_64-linux.acme-vm —
failed checks.x86_64-linux.clang-tidy 55s
nix-grpc-store-clang-tidy-0.1.0: Errors encountered while running clang-tidy ../src/client/transfer.cc:19:1: error: included header client_interceptor.h is not …
nix-grpc-store-clang-tidy-0.1.0:
Errors encountered while running clang-tidy
../src/client/transfer.cc:19:1: error: included header client_interceptor.h is not used directly [misc-include-cleaner,-warnings-as-errors]
   19 | #include <grpcpp/support/client_interceptor.h>
      | ^~~~~~~~~~~~~~~~~~~~~~~~~~~~~~~~~~~~~~~~~~~~~~
   20 | #include <grpcpp/support/status.h>
FAILED: [code=1] meson-internal__clang-tidy 
/nix/store/jaa89dphx07w3r26y7gh79a7b1mld5p4-meson-1.10.2/bin/meson --internal clangtidy /build/source /build/source/build --color always
ninja: build stopped: subcommand failed.
failed checks.x86_64-linux.exit-stress 25s
nix-grpc-store-0.1.0: [24/58] Compiling C++ object scheduler-grpc-bench.p/meson-generated_.._nix_remote.grpc.pb.cc.o [25/58] Compiling C++ object nar-fetcher-te …
nix-grpc-store-0.1.0:
[24/58] Compiling C++ object scheduler-grpc-bench.p/meson-generated_.._nix_remote.grpc.pb.cc.o
[25/58] Compiling C++ object nar-fetcher-test.p/meson-generated_.._nix_remote.grpc.pb.cc.o
[26/58] Compiling C++ object call-test.p/meson-generated_.._nix_remote.grpc.pb.cc.o
[27/58] Compiling C++ object libnix-grpc-dispatcher.a.p/src_daemon_dispatcher.cc.o
[28/58] Compiling C++ object farm-client-test.p/tests_farm-client-test.cc.o
[29/58] Compiling C++ object scheduler-grpc-bench.p/tests_scheduler-grpc-bench.cc.o
[30/58] Compiling C++ object oidc-test.p/tests_oidc-test.cc.o
ninja: build stopped: subcommand failed.
dependency failed checks.x86_64-linux.farm —
failed checks.x86_64-linux.fuzz 22s
nix-grpc-store-fuzzers-0.1.0: [35/102] Compiling C++ object fuzz-build-log.p/fuzz_build-log.cc.o [36/102] Compiling C++ object fuzz-tunnel-pump.p/meson-generate …
nix-grpc-store-fuzzers-0.1.0:
[35/102] Compiling C++ object fuzz-build-log.p/fuzz_build-log.cc.o
[36/102] Compiling C++ object fuzz-tunnel-pump.p/meson-generated_.._nix_remote.grpc.pb.cc.o
[37/102] Compiling C++ object fuzz-build-log.p/meson-generated_.._nix_remote.pb.cc.o
[38/102] Compiling C++ object fuzz-nar-frames.p/meson-generated_.._nix_remote.pb.cc.o
[39/102] Compiling C++ object fuzz-import-paths.p/meson-generated_.._nix_remote.grpc.pb.cc.o
[40/102] Compiling C++ object fuzz-import-paths.p/fuzz_import-paths.cc.o
[41/102] Compiling C++ object fuzz-build-log.p/meson-generated_.._nix_remote.grpc.pb.cc.o
ninja: build stopped: subcommand failed.
dependency failed checks.x86_64-linux.k3s —
failed checks.x86_64-linux.nix-tools-with-plugin 17s
nix-grpc-store-plugin-0.1.0: 218 | auto const forget = nix::Finally([&] -> void { | ^ ~~~~~~~ /nix/store/aw9gmpj6 …
nix-grpc-store-plugin-0.1.0:
  218 |         auto const forget = nix::Finally([&] -> void {
      |                             ^    ~~~~~~~
/nix/store/aw9gmpj62dccndf72qdh3qhv6mzqdyap-nix-util-2.35.2-dev/include/nix/util/finally.hh:12:52: note: 'Finally' declared here
   12 | class [[nodiscard("Finally values must be used")]] Finally
      |                                                    ^
1 error generated.
[10/11] Compiling C++ object nix-grpc-store.so.p/meson-generated_.._nix_remote.grpc.pb.cc.o
ninja: build stopped: subcommand failed.
failed checks.x86_64-linux.nix-with-plugin 17s
nix-grpc-store-plugin-0.1.0: 218 | auto const forget = nix::Finally([&] -> void { | ^ ~~~~~~~ /nix/store/kn5a85s0 …
nix-grpc-store-plugin-0.1.0:
  218 |         auto const forget = nix::Finally([&] -> void {
      |                             ^    ~~~~~~~
/nix/store/kn5a85s018r96dnhnnmnayyfcj375adv-nix-util-2.34.8-dev/include/nix/util/finally.hh:12:52: note: 'Finally' declared here
   12 | class [[nodiscard("Finally values must be used")]] Finally
      |                                                    ^
1 error generated.
[10/11] Compiling C++ object nix-grpc-store.so.p/meson-generated_.._nix_remote.grpc.pb.cc.o
ninja: build stopped: subcommand failed.
dependency failed checks.x86_64-linux.plugin-dispatcher —
failed checks.x86_64-linux.plugin-nix_2_31 17s
nix-grpc-store-plugin-0.1.0: 218 | auto const forget = nix::Finally([&] -> void { | ^ ~~~~~~~ /nix/store/qmahmdbq …
nix-grpc-store-plugin-0.1.0:
  218 |         auto const forget = nix::Finally([&] -> void {
      |                             ^    ~~~~~~~
/nix/store/qmahmdbq6rcwpcr8ixcprzq676yszkbr-nix-util-2.31.5-dev/include/nix/util/finally.hh:12:52: note: 'Finally' declared here
   12 | class [[nodiscard("Finally values must be used")]] Finally
      |                                                    ^
1 error generated.
[10/11] Compiling C++ object nix-grpc-store.so.p/meson-generated_.._nix_remote.grpc.pb.cc.o
ninja: build stopped: subcommand failed.
failed checks.x86_64-linux.plugin-nix_2_34 32s
nix-grpc-store-plugin-0.1.0: 218 | auto const forget = nix::Finally([&] -> void { | ^ ~~~~~~~ /nix/store/kn5a85s0 …
nix-grpc-store-plugin-0.1.0:
  218 |         auto const forget = nix::Finally([&] -> void {
      |                             ^    ~~~~~~~
/nix/store/kn5a85s018r96dnhnnmnayyfcj375adv-nix-util-2.34.8-dev/include/nix/util/finally.hh:12:52: note: 'Finally' declared here
   12 | class [[nodiscard("Finally values must be used")]] Finally
      |                                                    ^
1 error generated.
[10/11] Compiling C++ object nix-grpc-store.so.p/meson-generated_.._nix_remote.grpc.pb.cc.o
ninja: build stopped: subcommand failed.
failed checks.x86_64-linux.plugin-nix_2_35 32s
nix-grpc-store-plugin-0.1.0: 218 | auto const forget = nix::Finally([&] -> void { | ^ ~~~~~~~ /nix/store/aw9gmpj6 …
nix-grpc-store-plugin-0.1.0:
  218 |         auto const forget = nix::Finally([&] -> void {
      |                             ^    ~~~~~~~
/nix/store/aw9gmpj62dccndf72qdh3qhv6mzqdyap-nix-util-2.35.2-dev/include/nix/util/finally.hh:12:52: note: 'Finally' declared here
   12 | class [[nodiscard("Finally values must be used")]] Finally
      |                                                    ^
1 error generated.
[10/11] Compiling C++ object nix-grpc-store.so.p/meson-generated_.._nix_remote.grpc.pb.cc.o
ninja: build stopped: subcommand failed.
failed checks.x86_64-linux.sanitize-smoke 19s
nix-grpc-store-asan-0.1.0: [25/58] Compiling C++ object scheduler-grpc-bench.p/meson-generated_.._nix_remote.grpc.pb.cc.o [26/58] Precompiling header ../pch/dae …
nix-grpc-store-asan-0.1.0:
[25/58] Compiling C++ object scheduler-grpc-bench.p/meson-generated_.._nix_remote.grpc.pb.cc.o
[26/58] Precompiling header ../pch/daemon_pch.hh
[27/58] Compiling C++ object call-test.p/meson-generated_.._nix_remote.grpc.pb.cc.o
[28/58] Compiling C++ object farm-client-test.p/tests_farm-client-test.cc.o
[29/58] Compiling C++ object libnix-grpc-dispatcher.a.p/src_daemon_dispatcher.cc.o
[30/58] Compiling C++ object scheduler-grpc-bench.p/tests_scheduler-grpc-bench.cc.o
[31/58] Compiling C++ object oidc-test.p/tests_oidc-test.cc.o
ninja: build stopped: subcommand failed.
dependency failed checks.x86_64-linux.vm —
dependency failed checks.x86_64-linux.vm-upload —
5 already built
skipped attributes
status attribute duration
loading…