nixbot

builds

failed nix-grpc-store-fuzzers-0.2.0 checks.aarch64-linux.fuzz · build #646 · raw

1tribuchet: building on eliza
unpackPhase
2unpacking source archive /nix/store/wp1h27i6v32p7azb85j5pnrvbc03fbll-source3source root is source
configurePhase
4mesonConfigurePhase flags: --prefix=/nix/store/rba1j9i8iacvg8b46gb5cgy8y1vfcvn1-nix-grpc-store-fuzzers-0.2.0 --libdir=/nix/store/rba1j9i8iacvg8b46gb5cgy8y1vfcvn1-nix-grpc-store-fuzzers-0.2.0/lib --libexecdir=/nix/store/rba1j9i8iacvg8b46gb5cgy8y1vfcvn1-nix-grpc-store-fuzzers-0.2.0/libexec --bindir=/nix/store/rba1j9i8iacvg8b46gb5cgy8y1vfcvn1-nix-grpc-store-fuzzers-0.2.0/bin --sbindir=/nix/store/rba1j9i8iacvg8b46gb5cgy8y1vfcvn1-nix-grpc-store-fuzzers-0.2.0/sbin --includedir=/nix/store/rba1j9i8iacvg8b46gb5cgy8y1vfcvn1-nix-grpc-store-fuzzers-0.2.0/include --mandir=/nix/store/rba1j9i8iacvg8b46gb5cgy8y1vfcvn1-nix-grpc-store-fuzzers-0.2.0/share/man --infodir=/nix/store/rba1j9i8iacvg8b46gb5cgy8y1vfcvn1-nix-grpc-store-fuzzers-0.2.0/share/info --localedir=/nix/store/rba1j9i8iacvg8b46gb5cgy8y1vfcvn1-nix-grpc-store-fuzzers-0.2.0/share/locale -Dauto_features=enabled -Dwrap_mode=nodownload --buildtype=plain -Dfuzzers=true -Db_sanitize=address\,undefined -Db_lundef=false5The Meson build system6Version: 1.12.17Source dir: /build/source8Build dir: /build/source/build9Build type: native build10WARNING: Project does not target a minimum version but uses feature introduced in '1.1': meson.options file. Use meson_options.txt instead11Project name: nix-grpc-store12Project version: 0.2.013C++ compiler for the host machine: clang++ (clang 21.1.8 "clang version 21.1.8")14C++ linker for the host machine: clang++ ld.bfd 2.4615Host machine cpu family: aarch6416Host machine cpu: aarch6417Found pkg-config: YES (/nix/store/h82n3d0wdrgskdc3yvmz5l3c50h2snvp-pkg-config-wrapper-0.29.2/bin/pkg-config) 0.29.218Run-time dependency grpc++ found: YES 1.83.119Run-time dependency protobuf found: YES 36.2.020Run-time dependency libzstd found: YES 1.5.721Run-time dependency threads found: YES22Run-time dependency libcrypto found: YES 3.5.823Run-time dependency prometheus-cpp-core found: YES 1.3.024Run-time dependency prometheus-cpp-pull found: YES 1.3.025Run-time dependency absl_flat_hash_map found: YES 2026081726Run-time dependency absl_hash found: YES 2026081727Run-time dependency absl_synchronization found: YES 2026081728Compiler for C++ supports arguments -Werror=thread-safety: YES 29Run-time dependency nix-store found: YES 2.36.0pre20261011_651b0cd530Run-time dependency nix-util found: YES 2.36.0pre20261011_651b0cd531Run-time dependency jemalloc found: YES 5.3.1_032Run-time dependency libcurl found: YES 8.22.033Run-time dependency nlohmann_json found: YES 3.12.034Check usable header "jwt-cpp/traits/nlohmann-json/defaults.h" : YES 35Program protoc found: YES (/nix/store/8lbx3nmylh18yw8vh0c7fhv7bqjjlh3q-protobuf-36.2/bin/protoc)36Program grpc_cpp_plugin found: YES (/nix/store/hjj2bin7r66rmvq2jw1pmfdm8bpx637b-grpc-1.83.1/bin/grpc_cpp_plugin)37Program mold found: YES (/nix/store/gbq334xbibaz4gn184j7gs58m2spgwi7-mold-unwrapped-wrapper-2.42.1/bin/mold)38Run-time dependency dl found: YES39Program tests/farm-client-test.sh found: YES (/build/source/tests/farm-client-test.sh)40Program tests/oidc-test.sh found: YES (/build/source/tests/oidc-test.sh)41Build targets in project: 2942WARNING: Project specifies no minimum version but uses features which were added in versions:43 * 1.1: {'meson.options file'}4445nix-grpc-store 0.2.04647 User defined options48 auto_features: enabled49 b_lundef : false50 b_sanitize : address,undefined51 bindir : /nix/store/rba1j9i8iacvg8b46gb5cgy8y1vfcvn1-nix-grpc-store-fuzzers-0.2.0/bin52 buildtype : plain53 fuzzers : true54 includedir : /nix/store/rba1j9i8iacvg8b46gb5cgy8y1vfcvn1-nix-grpc-store-fuzzers-0.2.0/include55 infodir : /nix/store/rba1j9i8iacvg8b46gb5cgy8y1vfcvn1-nix-grpc-store-fuzzers-0.2.0/share/info56 libdir : /nix/store/rba1j9i8iacvg8b46gb5cgy8y1vfcvn1-nix-grpc-store-fuzzers-0.2.0/lib57 libexecdir : /nix/store/rba1j9i8iacvg8b46gb5cgy8y1vfcvn1-nix-grpc-store-fuzzers-0.2.0/libexec58 localedir : /nix/store/rba1j9i8iacvg8b46gb5cgy8y1vfcvn1-nix-grpc-store-fuzzers-0.2.0/share/locale59 mandir : /nix/store/rba1j9i8iacvg8b46gb5cgy8y1vfcvn1-nix-grpc-store-fuzzers-0.2.0/share/man60 prefix : /nix/store/rba1j9i8iacvg8b46gb5cgy8y1vfcvn1-nix-grpc-store-fuzzers-0.2.061 sbindir : /nix/store/rba1j9i8iacvg8b46gb5cgy8y1vfcvn1-nix-grpc-store-fuzzers-0.2.0/sbin62 wrap_mode : nodownload6364Found ninja-1.13.2 at /nix/store/lfkdyggn1ffslfd830l35jrvapr5lzri-ninja-1.13.2/bin/ninja65mesonConfigurePhase: enabled\ parallel\ building
buildPhase
66build flags: -j2467[1/109] Generating eds_proto with a custom command68[2/109] Generating nix_remote_proto with a custom command69[3/109] Compiling C++ object xfcc-test.p/tests_xfcc-test.cc.o70[4/109] Compiling C++ object nix-grpc-store-loader.so.p/src_client_plugin-loader.cc.o71[5/109] Compiling C++ object plugin-loader-test.p/tests_plugin-loader-test.cc.o72[6/109] Compiling C++ object upload-claims-test.p/tests_upload-claims-test.cc.o73[7/109] Compiling C++ object sbpl-test.p/tests_sbpl-test.cc.o74[8/109] Compiling C++ object log-spill-test.p/tests_log-spill-test.cc.o75[9/109] Compiling C++ object upload-spool-test.p/tests_upload-spool-test.cc.o76[10/109] Compiling C++ object sbpl-test.p/src_daemon_sbpl.cc.o77[11/109] Compiling C++ object sandbox-test.p/src_daemon_sandbox-linux.cc.o78[12/109] Compiling C++ object sandbox-test.p/tests_sandbox-test.cc.o79[13/109] Compiling C++ object libnix-grpc-dispatcher.a.p/meson-generated_.._nix_remote.pb.cc.o80[14/109] Compiling C++ object call-test.p/meson-generated_.._nix_remote.pb.cc.o81[15/109] Compiling C++ object nar-fetcher-test.p/meson-generated_.._nix_remote.pb.cc.o82[16/109] Compiling C++ object scheduler-test.p/tests_scheduler-test.cc.o83[17/109] Compiling C++ object nar-fetcher-test.p/meson-generated_.._nix_remote.grpc.pb.cc.o84[18/109] Compiling C++ object scheduler-grpc-bench.p/tests_scheduler-grpc-bench.cc.o85[19/109] Compiling C++ object nar-fetcher-test.p/tests_nar-fetcher-test.cc.o86[20/109] Compiling C++ object libnix-grpc-dispatcher.a.p/src_daemon_dispatcher.cc.o87[21/109] Compiling C++ object farm-client-test.p/tests_farm-client-test.cc.o88[22/109] Linking static target libnix-grpc-dispatcher.a89[23/109] Compiling C++ object dispatcher-bench.p/tests_dispatcher-bench.cc.o90[24/109] Compiling C++ object scheduler-grpc-bench.p/meson-generated_.._nix_remote.grpc.pb.cc.o91[25/109] Compiling C++ object fuzz-zstd-reader.p/fuzz_support.cc.o92[26/109] Compiling C++ object call-test.p/tests_call-test.cc.o93[27/109] Precompiling header ../pch/client_pch.hh94[28/109] Precompiling header ../pch/daemon_pch.hh95[29/109] Compiling C++ object fuzz-zstd-reader.p/meson-generated_.._nix_remote.pb.cc.o96[30/109] Compiling C++ object fuzz-import-paths.p/fuzz_support.cc.o97[31/109] Compiling C++ object oidc-test.p/tests_oidc-test.cc.o98[32/109] Compiling C++ object fuzz-tunnel-pump.p/fuzz_support.cc.o99[33/109] Compiling C++ object call-test.p/meson-generated_.._nix_remote.grpc.pb.cc.o100[34/109] Compiling C++ object fuzz-tunnel-pump.p/meson-generated_.._nix_remote.pb.cc.o101[35/109] Compiling C++ object fuzz-nar-frames.p/fuzz_support.cc.o102[36/109] Compiling C++ object fuzz-build-log.p/fuzz_support.cc.o103[37/109] Compiling C++ object nix-grpc-store.so.p/src_client_channel.cc.o104[38/109] Compiling C++ object nix-grpc-store.so.p/meson-generated_.._nix_remote.pb.cc.o105[39/109] Compiling C++ object fuzz-zstd-reader.p/fuzz_zstd-reader.cc.o106[40/109] Compiling C++ object fuzz-tunnel-pump.p/fuzz_tunnel-pump.cc.o107[41/109] Compiling C++ object nix-grpc-store.so.p/meson-generated_.._nix_remote.grpc.pb.cc.o108[42/109] Compiling C++ object nix-grpc-daemon.p/meson-generated_.._eds.pb.cc.o109[43/109] Compiling C++ object fuzz-import-paths.p/meson-generated_.._nix_remote.pb.cc.o110[44/109] Compiling C++ object nix-grpc-daemon.p/meson-generated_.._nix_remote.pb.cc.o111[45/109] Compiling C++ object fuzz-nar-frames.p/meson-generated_.._nix_remote.pb.cc.o112[46/109] Compiling C++ object nix-grpc-daemon.p/meson-generated_.._eds.grpc.pb.cc.o113[47/109] Compiling C++ object fuzz-build-log.p/meson-generated_.._nix_remote.pb.cc.o114[48/109] Compiling C++ object nix-grpc-daemon.p/src_client_channel.cc.o115[49/109] Compiling C++ object fuzz-zstd-reader.p/meson-generated_.._nix_remote.grpc.pb.cc.o116[50/109] Compiling C++ object fuzz-import-paths.p/fuzz_import-paths.cc.o117[51/109] Compiling C++ object fuzz-build-log.p/fuzz_build-log.cc.o118[52/109] Compiling C++ object fuzz-tunnel-pump.p/meson-generated_.._nix_remote.grpc.pb.cc.o119[53/109] Compiling C++ object nix-grpc-daemon.p/meson-generated_.._nix_remote.grpc.pb.cc.o120[54/109] Compiling C++ object nix-grpc-store.so.p/src_client_store.cc.o121[55/109] Compiling C++ object fuzz-import-paths.p/meson-generated_.._nix_remote.grpc.pb.cc.o122[56/109] Compiling C++ object nix-grpc-daemon.p/src_daemon_elector.cc.o123[57/109] Compiling C++ object nix-grpc-store.so.p/src_client_transfer.cc.o124[58/109] Compiling C++ object nix-grpc-daemon.p/src_daemon_backend.cc.o125[59/109] Compiling C++ object nix-grpc-daemon.p/src_daemon_sandbox-linux.cc.o126[60/109] Compiling C++ object fuzz-wire.p/meson-generated_.._nix_remote.pb.cc.o127[61/109] Compiling C++ object nix-grpc-store.so.p/src_client_build.cc.o128[62/109] Compiling C++ object fuzz-nar-frames.p/fuzz_nar-frames.cc.o129[63/109] Linking target nix-grpc-store-loader.so130[64/109] Linking target nix-grpc-store.so131[65/109] Linking target dispatcher-bench132[66/109] Linking target plugin-loader-test133[67/109] Linking target scheduler-grpc-bench134[68/109] Compiling C++ object fuzz-wire.p/fuzz_support.cc.o135[69/109] Linking target farm-client-test136[70/109] Compiling C++ object nix-grpc-daemon.p/src_daemon_eds.cc.o137[71/109] Compiling C++ object nix-grpc-daemon.p/src_daemon_options.cc.o138[72/109] Linking target sandbox-test139[73/109] Linking target scheduler-test140[74/109] Linking target sbpl-test141[75/109] Linking target oidc-test142[76/109] Linking target xfcc-test143[77/109] Compiling C++ object fuzz-acl.p/fuzz_support.cc.o144[78/109] Linking target log-spill-test145[79/109] Compiling C++ object fuzz-nar-frames.p/meson-generated_.._nix_remote.grpc.pb.cc.o146[80/109] Linking target upload-spool-test147[81/109] Linking target upload-claims-test148[82/109] Compiling C++ object fuzz-build-log.p/meson-generated_.._nix_remote.grpc.pb.cc.o149[83/109] Linking target nar-fetcher-test150[84/109] Linking target call-test151[85/109] Linking target fuzz-tunnel-pump152[86/109] Linking target fuzz-zstd-reader153[87/109] Linking target fuzz-import-paths154[88/109] Linking target fuzz-nar-frames155[89/109] Compiling C++ object fuzz-xfcc.p/fuzz_support.cc.o156[90/109] Compiling C++ object nix-grpc-daemon.p/src_daemon_auth.cc.o157[91/109] Linking target fuzz-build-log158[92/109] Compiling C++ object fuzz-xfcc.p/fuzz_xfcc.cc.o159[93/109] Compiling C++ object fuzz-acl.p/fuzz_acl.cc.o160[94/109] Compiling C++ object fuzz-acl.p/meson-generated_.._nix_remote.pb.cc.o161[95/109] Compiling C++ object nix-grpc-daemon.p/src_daemon_main.cc.o162[96/109] Compiling C++ object fuzz-wire.p/fuzz_wire.cc.o163[97/109] Compiling C++ object fuzz-xfcc.p/meson-generated_.._nix_remote.pb.cc.o164[98/109] Compiling C++ object fuzz-gen-seeds.p/meson-generated_.._nix_remote.pb.cc.o165[99/109] Compiling C++ object nix-grpc-daemon.p/src_daemon_coordinator.cc.o166[100/109] Linking target nix-grpc-daemon167FAILED: [code=1] nix-grpc-daemon 168clang++ -o nix-grpc-daemon nix-grpc-daemon.p/meson-generated_.._nix_remote.pb.cc.o nix-grpc-daemon.p/meson-generated_.._nix_remote.grpc.pb.cc.o nix-grpc-daemon.p/meson-generated_.._eds.pb.cc.o nix-grpc-daemon.p/meson-generated_.._eds.grpc.pb.cc.o nix-grpc-daemon.p/src_daemon_main.cc.o nix-grpc-daemon.p/src_client_channel.cc.o nix-grpc-daemon.p/src_daemon_elector.cc.o nix-grpc-daemon.p/src_daemon_auth.cc.o nix-grpc-daemon.p/src_daemon_backend.cc.o nix-grpc-daemon.p/src_daemon_coordinator.cc.o nix-grpc-daemon.p/src_daemon_eds.cc.o nix-grpc-daemon.p/src_daemon_options.cc.o nix-grpc-daemon.p/src_daemon_sandbox-linux.cc.o -fsanitize=address,undefined -Wl,--as-needed -Wl,--allow-shlib-undefined -fuse-ld=mold -Wl,--start-group libnix-grpc-dispatcher.a /nix/store/hjj2bin7r66rmvq2jw1pmfdm8bpx637b-grpc-1.83.1/lib/libgrpc++.so /nix/store/hjj2bin7r66rmvq2jw1pmfdm8bpx637b-grpc-1.83.1/lib/libgrpc.so /nix/store/5i9z8yspjvj17lbf4jip3sgdh42dqq1v-abseil-cpp-20260817.0/lib/libabsl_statusor.so /nix/store/hjj2bin7r66rmvq2jw1pmfdm8bpx637b-grpc-1.83.1/lib/libgpr.so /nix/store/5i9z8yspjvj17lbf4jip3sgdh42dqq1v-abseil-cpp-20260817.0/lib/libabsl_log_internal_check_op.so /nix/store/5i9z8yspjvj17lbf4jip3sgdh42dqq1v-abseil-cpp-20260817.0/lib/libabsl_flags_internal.so /nix/store/5i9z8yspjvj17lbf4jip3sgdh42dqq1v-abseil-cpp-20260817.0/lib/libabsl_flags_reflection.so /nix/store/5i9z8yspjvj17lbf4jip3sgdh42dqq1v-abseil-cpp-20260817.0/lib/libabsl_flags_private_handle_accessor.so /nix/store/5i9z8yspjvj17lbf4jip3sgdh42dqq1v-abseil-cpp-20260817.0/lib/libabsl_flags_commandlineflag.so /nix/store/5i9z8yspjvj17lbf4jip3sgdh42dqq1v-abseil-cpp-20260817.0/lib/libabsl_flags_commandlineflag_internal.so /nix/store/5i9z8yspjvj17lbf4jip3sgdh42dqq1v-abseil-cpp-20260817.0/lib/libabsl_flags_config.so /nix/store/5i9z8yspjvj17lbf4jip3sgdh42dqq1v-abseil-cpp-20260817.0/lib/libabsl_flags_program_name.so /nix/store/5i9z8yspjvj17lbf4jip3sgdh42dqq1v-abseil-cpp-20260817.0/lib/libabsl_raw_hash_set.so /nix/store/5i9z8yspjvj17lbf4jip3sgdh42dqq1v-abseil-cpp-20260817.0/lib/libabsl_hashtablez_sampler.so /nix/store/5i9z8yspjvj17lbf4jip3sgdh42dqq1v-abseil-cpp-20260817.0/lib/libabsl_flags_marshalling.so /nix/store/5i9z8yspjvj17lbf4jip3sgdh42dqq1v-abseil-cpp-20260817.0/lib/libabsl_log_internal_conditions.so /nix/store/5i9z8yspjvj17lbf4jip3sgdh42dqq1v-abseil-cpp-20260817.0/lib/libabsl_log_internal_message.so /nix/store/5i9z8yspjvj17lbf4jip3sgdh42dqq1v-abseil-cpp-20260817.0/lib/libabsl_examine_stack.so /nix/store/5i9z8yspjvj17lbf4jip3sgdh42dqq1v-abseil-cpp-20260817.0/lib/libabsl_log_internal_format.so /nix/store/5i9z8yspjvj17lbf4jip3sgdh42dqq1v-abseil-cpp-20260817.0/lib/libabsl_log_internal_nullguard.so /nix/store/5i9z8yspjvj17lbf4jip3sgdh42dqq1v-abseil-cpp-20260817.0/lib/libabsl_log_internal_structured_proto.so /nix/store/5i9z8yspjvj17lbf4jip3sgdh42dqq1v-abseil-cpp-20260817.0/lib/libabsl_log_internal_log_sink_set.so /nix/store/5i9z8yspjvj17lbf4jip3sgdh42dqq1v-abseil-cpp-20260817.0/lib/libabsl_log_internal_globals.so /nix/store/5i9z8yspjvj17lbf4jip3sgdh42dqq1v-abseil-cpp-20260817.0/lib/libabsl_log_sink.so /nix/store/5i9z8yspjvj17lbf4jip3sgdh42dqq1v-abseil-cpp-20260817.0/lib/libabsl_log_entry.so /nix/store/5i9z8yspjvj17lbf4jip3sgdh42dqq1v-abseil-cpp-20260817.0/lib/libabsl_log_internal_proto.so /nix/store/5i9z8yspjvj17lbf4jip3sgdh42dqq1v-abseil-cpp-20260817.0/lib/libabsl_log_globals.so /nix/store/5i9z8yspjvj17lbf4jip3sgdh42dqq1v-abseil-cpp-20260817.0/lib/libabsl_vlog_config_internal.so /nix/store/5i9z8yspjvj17lbf4jip3sgdh42dqq1v-abseil-cpp-20260817.0/lib/libabsl_log_internal_fnmatch.so /nix/store/5i9z8yspjvj17lbf4jip3sgdh42dqq1v-abseil-cpp-20260817.0/lib/libabsl_random_distributions.so /nix/store/5i9z8yspjvj17lbf4jip3sgdh42dqq1v-abseil-cpp-20260817.0/lib/libabsl_random_seed_sequences.so /nix/store/5i9z8yspjvj17lbf4jip3sgdh42dqq1v-abseil-cpp-20260817.0/lib/libabsl_random_internal_entropy_pool.so /nix/store/5i9z8yspjvj17lbf4jip3sgdh42dqq1v-abseil-cpp-20260817.0/lib/libabsl_random_internal_randen.so /nix/store/5i9z8yspjvj17lbf4jip3sgdh42dqq1v-abseil-cpp-20260817.0/lib/libabsl_random_internal_randen_hwaes.so /nix/store/5i9z8yspjvj17lbf4jip3sgdh42dqq1v-abseil-cpp-20260817.0/lib/libabsl_random_internal_randen_hwaes_impl.so /nix/store/5i9z8yspjvj17lbf4jip3sgdh42dqq1v-abseil-cpp-20260817.0/lib/libabsl_random_internal_randen_slow.so /nix/store/5i9z8yspjvj17lbf4jip3sgdh42dqq1v-abseil-cpp-20260817.0/lib/libabsl_random_internal_platform.so /nix/store/5i9z8yspjvj17lbf4jip3sgdh42dqq1v-abseil-cpp-20260817.0/lib/libabsl_random_internal_seed_material.so /nix/store/5i9z8yspjvj17lbf4jip3sgdh42dqq1v-abseil-cpp-20260817.0/lib/libabsl_random_seed_gen_exception.so /nix/store/5i9z8yspjvj17lbf4jip3sgdh42dqq1v-abseil-cpp-20260817.0/lib/libabsl_status.so /nix/store/5i9z8yspjvj17lbf4jip3sgdh42dqq1v-abseil-cpp-20260817.0/lib/libabsl_cord.so /nix/store/5i9z8yspjvj17lbf4jip3sgdh42dqq1v-abseil-cpp-20260817.0/lib/libabsl_cordz_info.so /nix/store/5i9z8yspjvj17lbf4jip3sgdh42dqq1v-abseil-cpp-20260817.0/lib/libabsl_cord_internal.so /nix/store/5i9z8yspjvj17lbf4jip3sgdh42dqq1v-abseil-cpp-20260817.0/lib/libabsl_hash.so /nix/store/5i9z8yspjvj17lbf4jip3sgdh42dqq1v-abseil-cpp-20260817.0/lib/libabsl_city.so /nix/store/5i9z8yspjvj17lbf4jip3sgdh42dqq1v-abseil-cpp-20260817.0/lib/libabsl_cordz_functions.so /nix/store/5i9z8yspjvj17lbf4jip3sgdh42dqq1v-abseil-cpp-20260817.0/lib/libabsl_exponential_biased.so /nix/store/5i9z8yspjvj17lbf4jip3sgdh42dqq1v-abseil-cpp-20260817.0/lib/libabsl_cordz_handle.so /nix/store/5i9z8yspjvj17lbf4jip3sgdh42dqq1v-abseil-cpp-20260817.0/lib/libabsl_crc_cord_state.so /nix/store/5i9z8yspjvj17lbf4jip3sgdh42dqq1v-abseil-cpp-20260817.0/lib/libabsl_crc32c.so /nix/store/5i9z8yspjvj17lbf4jip3sgdh42dqq1v-abseil-cpp-20260817.0/lib/libabsl_crc_internal.so /nix/store/5i9z8yspjvj17lbf4jip3sgdh42dqq1v-abseil-cpp-20260817.0/lib/libabsl_base_cpu_detect.so /nix/store/5i9z8yspjvj17lbf4jip3sgdh42dqq1v-abseil-cpp-20260817.0/lib/libabsl_leak_check.so /nix/store/5i9z8yspjvj17lbf4jip3sgdh42dqq1v-abseil-cpp-20260817.0/lib/libabsl_strerror.so /nix/store/5i9z8yspjvj17lbf4jip3sgdh42dqq1v-abseil-cpp-20260817.0/lib/libabsl_str_format_internal.so /nix/store/5i9z8yspjvj17lbf4jip3sgdh42dqq1v-abseil-cpp-20260817.0/lib/libabsl_synchronization.so /nix/store/5i9z8yspjvj17lbf4jip3sgdh42dqq1v-abseil-cpp-20260817.0/lib/libabsl_graphcycles_internal.so /nix/store/5i9z8yspjvj17lbf4jip3sgdh42dqq1v-abseil-cpp-20260817.0/lib/libabsl_kernel_timeout_internal.so /nix/store/5i9z8yspjvj17lbf4jip3sgdh42dqq1v-abseil-cpp-20260817.0/lib/libabsl_stacktrace.so /nix/store/5i9z8yspjvj17lbf4jip3sgdh42dqq1v-abseil-cpp-20260817.0/lib/libabsl_symbolize.so /nix/store/5i9z8yspjvj17lbf4jip3sgdh42dqq1v-abseil-cpp-20260817.0/lib/libabsl_debugging_internal.so /nix/store/5i9z8yspjvj17lbf4jip3sgdh42dqq1v-abseil-cpp-20260817.0/lib/libabsl_demangle_internal.so /nix/store/5i9z8yspjvj17lbf4jip3sgdh42dqq1v-abseil-cpp-20260817.0/lib/libabsl_demangle_rust.so /nix/store/5i9z8yspjvj17lbf4jip3sgdh42dqq1v-abseil-cpp-20260817.0/lib/libabsl_decode_rust_punycode.so /nix/store/5i9z8yspjvj17lbf4jip3sgdh42dqq1v-abseil-cpp-20260817.0/lib/libabsl_utf8_for_code_point.so /nix/store/5i9z8yspjvj17lbf4jip3sgdh42dqq1v-abseil-cpp-20260817.0/lib/libabsl_malloc_internal.so /nix/store/5i9z8yspjvj17lbf4jip3sgdh42dqq1v-abseil-cpp-20260817.0/lib/libabsl_tracing_internal.so /nix/store/5i9z8yspjvj17lbf4jip3sgdh42dqq1v-abseil-cpp-20260817.0/lib/libabsl_time.so /nix/store/5i9z8yspjvj17lbf4jip3sgdh42dqq1v-abseil-cpp-20260817.0/lib/libabsl_civil_time.so /nix/store/5i9z8yspjvj17lbf4jip3sgdh42dqq1v-abseil-cpp-20260817.0/lib/libabsl_strings.so /nix/store/5i9z8yspjvj17lbf4jip3sgdh42dqq1v-abseil-cpp-20260817.0/lib/libabsl_strings_internal.so /nix/store/5i9z8yspjvj17lbf4jip3sgdh42dqq1v-abseil-cpp-20260817.0/lib/libabsl_hardening.so /nix/store/5i9z8yspjvj17lbf4jip3sgdh42dqq1v-abseil-cpp-20260817.0/lib/libabsl_int128.so /nix/store/5i9z8yspjvj17lbf4jip3sgdh42dqq1v-abseil-cpp-20260817.0/lib/libabsl_base.so -lrt /nix/store/5i9z8yspjvj17lbf4jip3sgdh42dqq1v-abseil-cpp-20260817.0/lib/libabsl_spinlock_wait.so /nix/store/5i9z8yspjvj17lbf4jip3sgdh42dqq1v-abseil-cpp-20260817.0/lib/libabsl_source_location.so /nix/store/5i9z8yspjvj17lbf4jip3sgdh42dqq1v-abseil-cpp-20260817.0/lib/libabsl_throw_delegate.so /nix/store/5i9z8yspjvj17lbf4jip3sgdh42dqq1v-abseil-cpp-20260817.0/lib/libabsl_raw_logging_internal.so /nix/store/5i9z8yspjvj17lbf4jip3sgdh42dqq1v-abseil-cpp-20260817.0/lib/libabsl_log_severity.so /nix/store/5i9z8yspjvj17lbf4jip3sgdh42dqq1v-abseil-cpp-20260817.0/lib/libabsl_time_zone.so /nix/store/hg64psdc3cc5dlrhh8kyksjk3q97g3bk-protobuf-36.2-lib/lib/libprotobuf.so /nix/store/5i9z8yspjvj17lbf4jip3sgdh42dqq1v-abseil-cpp-20260817.0/lib/libabsl_die_if_null.so /nix/store/5i9z8yspjvj17lbf4jip3sgdh42dqq1v-abseil-cpp-20260817.0/lib/libabsl_log_initialize.so /nix/store/hg64psdc3cc5dlrhh8kyksjk3q97g3bk-protobuf-36.2-lib/lib/libutf8_validity.so /nix/store/hg64psdc3cc5dlrhh8kyksjk3q97g3bk-protobuf-36.2-lib/lib/libutf8_range.so /nix/store/37pj113a0sm14a3c8mymvfrm6msfcy82-zstd-1.5.7/lib/libzstd.so -pthread /nix/store/nccqp6jg85jvn979li6mdj6fqp522az4-prometheus-cpp-1.3.0/lib/libprometheus-cpp-core.so /nix/store/nccqp6jg85jvn979li6mdj6fqp522az4-prometheus-cpp-1.3.0/lib/libprometheus-cpp-pull.so /nix/store/q5crci3x6vw32m6qsnbd53fmkvi65llb-nix-util-2.36.0pre20261011_651b0cd5/lib/libnixutil.so /nix/store/6yi5v7iswrvg0hsl8rai9bjrmgfhkhpl-libarchive-3.8.9-lib/lib/libarchive.so /nix/store/w7rygrd3aayxpp6acvz1abxqcirjak6v-nix-store-2.36.0pre20261011_651b0cd5/lib/libnixstore.so /nix/store/d05khq8gbpqw7ykgnjg8qixqyfa1idj5-curl-8.22.0/lib/libcurl.so /nix/store/db07pw9avlwysb3v68cfp9cijg2mmfns-openssl-3.5.8/lib/libcrypto.so /nix/store/hgmz4zqs3swxkxibxbqaqc6bj0xlpqyr-jemalloc-5.3.1/lib/libjemalloc.so -Wl,--end-group169mold: error: undefined symbol: _ZN3nix10string2IntITkSt8integralmEESt8optionalIT_ESt17basic_string_viewIcSt11char_traitsIcEE170>>> referenced by options.cc171>>> nix-grpc-daemon.p/src_daemon_options.cc.o:(unsigned long nix::string2IntWithUnitPrefix<unsigned long>(std::basic_string_view<char, std::char_traits<char> >))172clang++: error: linker command failed with exit code 1 (use -v to see invocation)173[101/109] Compiling C++ object fuzz-gen-seeds.p/meson-generated_.._nix_remote.grpc.pb.cc.o174[102/109] Compiling C++ object fuzz-gen-seeds.p/fuzz_gen-seeds.cc.o175[103/109] Compiling C++ object fuzz-xfcc.p/meson-generated_.._nix_remote.grpc.pb.cc.o176[104/109] Compiling C++ object fuzz-wire.p/meson-generated_.._nix_remote.grpc.pb.cc.o177[105/109] Compiling C++ object fuzz-acl.p/meson-generated_.._nix_remote.grpc.pb.cc.o178ninja: build stopped: subcommand failed.