nix-grpc-store-asan-0.2.0
checks.aarch64-linux.sanitize-smoke
· build #646
· raw
1tribuchet: building on eliza
unpackPhase
2unpacking source archive /nix/store/wp1h27i6v32p7azb85j5pnrvbc03fbll-source3source root is source4separate-debug-info: recording checksum of source files for debug support...configurePhase
5mesonConfigurePhase flags: --prefix=/nix/store/w52nlvvn3wr5c0acf11pbza852gqssrx-nix-grpc-store-asan-0.2.0 --libdir=/nix/store/w52nlvvn3wr5c0acf11pbza852gqssrx-nix-grpc-store-asan-0.2.0/lib --libexecdir=/nix/store/w52nlvvn3wr5c0acf11pbza852gqssrx-nix-grpc-store-asan-0.2.0/libexec --bindir=/nix/store/w52nlvvn3wr5c0acf11pbza852gqssrx-nix-grpc-store-asan-0.2.0/bin --sbindir=/nix/store/w52nlvvn3wr5c0acf11pbza852gqssrx-nix-grpc-store-asan-0.2.0/sbin --includedir=/nix/store/w52nlvvn3wr5c0acf11pbza852gqssrx-nix-grpc-store-asan-0.2.0/include --mandir=/nix/store/w52nlvvn3wr5c0acf11pbza852gqssrx-nix-grpc-store-asan-0.2.0/share/man --infodir=/nix/store/w52nlvvn3wr5c0acf11pbza852gqssrx-nix-grpc-store-asan-0.2.0/share/info --localedir=/nix/store/w52nlvvn3wr5c0acf11pbza852gqssrx-nix-grpc-store-asan-0.2.0/share/locale -Dauto_features=enabled -Dwrap_mode=nodownload --buildtype=plain -Db_sanitize=address\,undefined -Db_lundef=false6The Meson build system7Version: 1.12.18Source dir: /build/source9Build dir: /build/source/build10Build type: native build11WARNING: Project does not target a minimum version but uses feature introduced in '1.1': meson.options file. Use meson_options.txt instead12Project name: nix-grpc-store13Project version: 0.2.014C++ compiler for the host machine: clang++ (clang 21.1.8 "clang version 21.1.8")15C++ linker for the host machine: clang++ ld.bfd 2.4616Host machine cpu family: aarch6417Host machine cpu: aarch6418Found pkg-config: YES (/nix/store/h82n3d0wdrgskdc3yvmz5l3c50h2snvp-pkg-config-wrapper-0.29.2/bin/pkg-config) 0.29.219Run-time dependency grpc++ found: YES 1.83.120Run-time dependency protobuf found: YES 36.2.021Run-time dependency libzstd found: YES 1.5.722Run-time dependency threads found: YES23Run-time dependency libcrypto found: YES 3.5.824Run-time dependency prometheus-cpp-core found: YES 1.3.025Run-time dependency prometheus-cpp-pull found: YES 1.3.026Run-time dependency absl_flat_hash_map found: YES 2026081727Run-time dependency absl_hash found: YES 2026081728Run-time dependency absl_synchronization found: YES 2026081729Compiler for C++ supports arguments -Werror=thread-safety: YES 30Run-time dependency nix-store found: YES 2.36.0pre20261011_651b0cd531Run-time dependency nix-util found: YES 2.36.0pre20261011_651b0cd532Run-time dependency jemalloc found: YES 5.3.1_033Run-time dependency libcurl found: YES 8.22.034Run-time dependency nlohmann_json found: YES 3.12.035Check usable header "jwt-cpp/traits/nlohmann-json/defaults.h" : YES 36Program protoc found: YES (/nix/store/8lbx3nmylh18yw8vh0c7fhv7bqjjlh3q-protobuf-36.2/bin/protoc)37Program grpc_cpp_plugin found: YES (/nix/store/hjj2bin7r66rmvq2jw1pmfdm8bpx637b-grpc-1.83.1/bin/grpc_cpp_plugin)38Program mold found: YES (/nix/store/gbq334xbibaz4gn184j7gs58m2spgwi7-mold-unwrapped-wrapper-2.42.1/bin/mold)39Run-time dependency dl found: YES40Program tests/farm-client-test.sh found: YES (/build/source/tests/farm-client-test.sh)41Program tests/oidc-test.sh found: YES (/build/source/tests/oidc-test.sh)42Build targets in project: 2043WARNING: Project specifies no minimum version but uses features which were added in versions:44 * 1.1: {'meson.options file'}4546nix-grpc-store 0.2.04748 User defined options49 auto_features: enabled50 b_lundef : false51 b_sanitize : address,undefined52 bindir : /nix/store/w52nlvvn3wr5c0acf11pbza852gqssrx-nix-grpc-store-asan-0.2.0/bin53 buildtype : plain54 includedir : /nix/store/w52nlvvn3wr5c0acf11pbza852gqssrx-nix-grpc-store-asan-0.2.0/include55 infodir : /nix/store/w52nlvvn3wr5c0acf11pbza852gqssrx-nix-grpc-store-asan-0.2.0/share/info56 libdir : /nix/store/w52nlvvn3wr5c0acf11pbza852gqssrx-nix-grpc-store-asan-0.2.0/lib57 libexecdir : /nix/store/w52nlvvn3wr5c0acf11pbza852gqssrx-nix-grpc-store-asan-0.2.0/libexec58 localedir : /nix/store/w52nlvvn3wr5c0acf11pbza852gqssrx-nix-grpc-store-asan-0.2.0/share/locale59 mandir : /nix/store/w52nlvvn3wr5c0acf11pbza852gqssrx-nix-grpc-store-asan-0.2.0/share/man60 prefix : /nix/store/w52nlvvn3wr5c0acf11pbza852gqssrx-nix-grpc-store-asan-0.2.061 sbindir : /nix/store/w52nlvvn3wr5c0acf11pbza852gqssrx-nix-grpc-store-asan-0.2.0/sbin62 wrap_mode : nodownload6364Found ninja-1.13.2 at /nix/store/lfkdyggn1ffslfd830l35jrvapr5lzri-ninja-1.13.2/bin/ninja65mesonConfigurePhase: enabled\ parallel\ building66configurePhase completed in 30 secondsbuildPhase
67build flags: -j2468[1/65] Generating nix_remote_proto with a custom command69[2/65] Generating eds_proto with a custom command70[3/65] Compiling C++ object plugin-loader-test.p/tests_plugin-loader-test.cc.o71[4/65] Compiling C++ object xfcc-test.p/tests_xfcc-test.cc.o72[5/65] Compiling C++ object sbpl-test.p/src_daemon_sbpl.cc.o73[6/65] Compiling C++ object nix-grpc-store-loader.so.p/src_client_plugin-loader.cc.o74[7/65] Linking target plugin-loader-test75clang++: warning: argument unused during compilation: '-Wa,--compress-debug-sections' [-Wunused-command-line-argument]76[8/65] Linking target nix-grpc-store-loader.so77clang++: warning: argument unused during compilation: '-Wa,--compress-debug-sections' [-Wunused-command-line-argument]78[9/65] Compiling C++ object sbpl-test.p/tests_sbpl-test.cc.o79[10/65] Compiling C++ object upload-claims-test.p/tests_upload-claims-test.cc.o80[11/65] Compiling C++ object sandbox-test.p/src_daemon_sandbox-linux.cc.o81[12/65] Linking target sbpl-test82clang++: warning: argument unused during compilation: '-Wa,--compress-debug-sections' [-Wunused-command-line-argument]83[13/65] Linking target xfcc-test84clang++: warning: argument unused during compilation: '-Wa,--compress-debug-sections' [-Wunused-command-line-argument]85[14/65] Linking target upload-claims-test86clang++: warning: argument unused during compilation: '-Wa,--compress-debug-sections' [-Wunused-command-line-argument]87[15/65] Compiling C++ object sandbox-test.p/tests_sandbox-test.cc.o88[16/65] Compiling C++ object log-spill-test.p/tests_log-spill-test.cc.o89[17/65] Compiling C++ object upload-spool-test.p/tests_upload-spool-test.cc.o90[18/65] Linking target log-spill-test91clang++: warning: argument unused during compilation: '-Wa,--compress-debug-sections' [-Wunused-command-line-argument]92[19/65] Linking target sandbox-test93clang++: warning: argument unused during compilation: '-Wa,--compress-debug-sections' [-Wunused-command-line-argument]94[20/65] Linking target upload-spool-test95clang++: warning: argument unused during compilation: '-Wa,--compress-debug-sections' [-Wunused-command-line-argument]96[21/65] Compiling C++ object call-test.p/meson-generated_.._nix_remote.pb.cc.o97[22/65] Compiling C++ object libnix-grpc-dispatcher.a.p/meson-generated_.._nix_remote.pb.cc.o98[23/65] Compiling C++ object nar-fetcher-test.p/meson-generated_.._nix_remote.pb.cc.o99[24/65] Compiling C++ object scheduler-test.p/tests_scheduler-test.cc.o100[25/65] Compiling C++ object scheduler-grpc-bench.p/meson-generated_.._nix_remote.grpc.pb.cc.o101[26/65] Compiling C++ object nar-fetcher-test.p/tests_nar-fetcher-test.cc.o102[27/65] Linking target scheduler-test103clang++: warning: argument unused during compilation: '-Wa,--compress-debug-sections' [-Wunused-command-line-argument]104[28/65] Compiling C++ object nar-fetcher-test.p/meson-generated_.._nix_remote.grpc.pb.cc.o105[29/65] Compiling C++ object dispatcher-bench.p/tests_dispatcher-bench.cc.o106[30/65] Linking target nar-fetcher-test107clang++: warning: argument unused during compilation: '-Wa,--compress-debug-sections' [-Wunused-command-line-argument]108[31/65] Compiling C++ object scheduler-grpc-bench.p/tests_scheduler-grpc-bench.cc.o109[32/65] Precompiling header ../pch/daemon_pch.hh110[33/65] Compiling C++ object farm-client-test.p/tests_farm-client-test.cc.o111[34/65] Compiling C++ object libnix-grpc-dispatcher.a.p/src_daemon_dispatcher.cc.o112[35/65] Linking static target libnix-grpc-dispatcher.a113[36/65] Linking target farm-client-test114clang++: warning: argument unused during compilation: '-Wa,--compress-debug-sections' [-Wunused-command-line-argument]115[37/65] Precompiling header ../pch/client_pch.hh116[38/65] Linking target dispatcher-bench117clang++: warning: argument unused during compilation: '-Wa,--compress-debug-sections' [-Wunused-command-line-argument]118[39/65] Compiling C++ object call-test.p/tests_call-test.cc.o119[40/65] Linking target scheduler-grpc-bench120clang++: warning: argument unused during compilation: '-Wa,--compress-debug-sections' [-Wunused-command-line-argument]121[41/65] Compiling C++ object nix-grpc-daemon.p/meson-generated_.._eds.pb.cc.o122[42/65] Compiling C++ object nix-grpc-daemon.p/src_client_channel.cc.o123[43/65] Compiling C++ object nix-grpc-store.so.p/src_client_channel.cc.o124[44/65] Compiling C++ object nix-grpc-daemon.p/meson-generated_.._eds.grpc.pb.cc.o125[45/65] Compiling C++ object nix-grpc-daemon.p/src_daemon_sandbox-linux.cc.o126[46/65] Compiling C++ object nix-grpc-daemon.p/src_daemon_backend.cc.o127[47/65] Compiling C++ object nix-grpc-daemon.p/meson-generated_.._nix_remote.pb.cc.o128[48/65] Compiling C++ object oidc-test.p/tests_oidc-test.cc.o129[49/65] Compiling C++ object call-test.p/meson-generated_.._nix_remote.grpc.pb.cc.o130[50/65] Compiling C++ object nix-grpc-store.so.p/meson-generated_.._nix_remote.pb.cc.o131[51/65] Linking target oidc-test132clang++: warning: argument unused during compilation: '-Wa,--compress-debug-sections' [-Wunused-command-line-argument]133[52/65] Linking target call-test134clang++: warning: argument unused during compilation: '-Wa,--compress-debug-sections' [-Wunused-command-line-argument]135[53/65] Compiling C++ object nix-grpc-daemon.p/src_daemon_options.cc.o136[54/65] Compiling C++ object nix-grpc-daemon.p/src_daemon_elector.cc.o137[55/65] Compiling C++ object nix-grpc-daemon.p/meson-generated_.._nix_remote.grpc.pb.cc.o138[56/65] Compiling C++ object nix-grpc-store.so.p/meson-generated_.._nix_remote.grpc.pb.cc.o139[57/65] Compiling C++ object nix-grpc-daemon.p/src_daemon_eds.cc.o140[58/65] Compiling C++ object nix-grpc-store.so.p/src_client_store.cc.o141[59/65] Compiling C++ object nix-grpc-daemon.p/src_daemon_auth.cc.o142[60/65] Compiling C++ object nix-grpc-store.so.p/src_client_transfer.cc.o143[61/65] Compiling C++ object nix-grpc-store.so.p/src_client_build.cc.o144[62/65] Linking target nix-grpc-store.so145clang++: warning: argument unused during compilation: '-Wa,--compress-debug-sections' [-Wunused-command-line-argument]146[63/65] Compiling C++ object nix-grpc-daemon.p/src_daemon_coordinator.cc.o147[64/65] Compiling C++ object nix-grpc-daemon.p/src_daemon_main.cc.o148[65/65] Linking target nix-grpc-daemon149FAILED: [code=1] nix-grpc-daemon 150clang++ -o nix-grpc-daemon nix-grpc-daemon.p/meson-generated_.._nix_remote.pb.cc.o nix-grpc-daemon.p/meson-generated_.._nix_remote.grpc.pb.cc.o nix-grpc-daemon.p/meson-generated_.._eds.pb.cc.o nix-grpc-daemon.p/meson-generated_.._eds.grpc.pb.cc.o nix-grpc-daemon.p/src_daemon_main.cc.o nix-grpc-daemon.p/src_client_channel.cc.o nix-grpc-daemon.p/src_daemon_elector.cc.o nix-grpc-daemon.p/src_daemon_auth.cc.o nix-grpc-daemon.p/src_daemon_backend.cc.o nix-grpc-daemon.p/src_daemon_coordinator.cc.o nix-grpc-daemon.p/src_daemon_eds.cc.o nix-grpc-daemon.p/src_daemon_options.cc.o nix-grpc-daemon.p/src_daemon_sandbox-linux.cc.o -fsanitize=address,undefined -Wl,--as-needed -Wl,--allow-shlib-undefined -fuse-ld=mold -Wl,--start-group libnix-grpc-dispatcher.a /nix/store/hjj2bin7r66rmvq2jw1pmfdm8bpx637b-grpc-1.83.1/lib/libgrpc++.so /nix/store/hjj2bin7r66rmvq2jw1pmfdm8bpx637b-grpc-1.83.1/lib/libgrpc.so /nix/store/5i9z8yspjvj17lbf4jip3sgdh42dqq1v-abseil-cpp-20260817.0/lib/libabsl_statusor.so /nix/store/hjj2bin7r66rmvq2jw1pmfdm8bpx637b-grpc-1.83.1/lib/libgpr.so /nix/store/5i9z8yspjvj17lbf4jip3sgdh42dqq1v-abseil-cpp-20260817.0/lib/libabsl_log_internal_check_op.so /nix/store/5i9z8yspjvj17lbf4jip3sgdh42dqq1v-abseil-cpp-20260817.0/lib/libabsl_flags_internal.so /nix/store/5i9z8yspjvj17lbf4jip3sgdh42dqq1v-abseil-cpp-20260817.0/lib/libabsl_flags_reflection.so /nix/store/5i9z8yspjvj17lbf4jip3sgdh42dqq1v-abseil-cpp-20260817.0/lib/libabsl_flags_private_handle_accessor.so /nix/store/5i9z8yspjvj17lbf4jip3sgdh42dqq1v-abseil-cpp-20260817.0/lib/libabsl_flags_commandlineflag.so /nix/store/5i9z8yspjvj17lbf4jip3sgdh42dqq1v-abseil-cpp-20260817.0/lib/libabsl_flags_commandlineflag_internal.so /nix/store/5i9z8yspjvj17lbf4jip3sgdh42dqq1v-abseil-cpp-20260817.0/lib/libabsl_flags_config.so /nix/store/5i9z8yspjvj17lbf4jip3sgdh42dqq1v-abseil-cpp-20260817.0/lib/libabsl_flags_program_name.so /nix/store/5i9z8yspjvj17lbf4jip3sgdh42dqq1v-abseil-cpp-20260817.0/lib/libabsl_raw_hash_set.so /nix/store/5i9z8yspjvj17lbf4jip3sgdh42dqq1v-abseil-cpp-20260817.0/lib/libabsl_hashtablez_sampler.so /nix/store/5i9z8yspjvj17lbf4jip3sgdh42dqq1v-abseil-cpp-20260817.0/lib/libabsl_flags_marshalling.so /nix/store/5i9z8yspjvj17lbf4jip3sgdh42dqq1v-abseil-cpp-20260817.0/lib/libabsl_log_internal_conditions.so /nix/store/5i9z8yspjvj17lbf4jip3sgdh42dqq1v-abseil-cpp-20260817.0/lib/libabsl_log_internal_message.so /nix/store/5i9z8yspjvj17lbf4jip3sgdh42dqq1v-abseil-cpp-20260817.0/lib/libabsl_examine_stack.so /nix/store/5i9z8yspjvj17lbf4jip3sgdh42dqq1v-abseil-cpp-20260817.0/lib/libabsl_log_internal_format.so /nix/store/5i9z8yspjvj17lbf4jip3sgdh42dqq1v-abseil-cpp-20260817.0/lib/libabsl_log_internal_nullguard.so /nix/store/5i9z8yspjvj17lbf4jip3sgdh42dqq1v-abseil-cpp-20260817.0/lib/libabsl_log_internal_structured_proto.so /nix/store/5i9z8yspjvj17lbf4jip3sgdh42dqq1v-abseil-cpp-20260817.0/lib/libabsl_log_internal_log_sink_set.so /nix/store/5i9z8yspjvj17lbf4jip3sgdh42dqq1v-abseil-cpp-20260817.0/lib/libabsl_log_internal_globals.so /nix/store/5i9z8yspjvj17lbf4jip3sgdh42dqq1v-abseil-cpp-20260817.0/lib/libabsl_log_sink.so /nix/store/5i9z8yspjvj17lbf4jip3sgdh42dqq1v-abseil-cpp-20260817.0/lib/libabsl_log_entry.so /nix/store/5i9z8yspjvj17lbf4jip3sgdh42dqq1v-abseil-cpp-20260817.0/lib/libabsl_log_internal_proto.so /nix/store/5i9z8yspjvj17lbf4jip3sgdh42dqq1v-abseil-cpp-20260817.0/lib/libabsl_log_globals.so /nix/store/5i9z8yspjvj17lbf4jip3sgdh42dqq1v-abseil-cpp-20260817.0/lib/libabsl_vlog_config_internal.so /nix/store/5i9z8yspjvj17lbf4jip3sgdh42dqq1v-abseil-cpp-20260817.0/lib/libabsl_log_internal_fnmatch.so /nix/store/5i9z8yspjvj17lbf4jip3sgdh42dqq1v-abseil-cpp-20260817.0/lib/libabsl_random_distributions.so /nix/store/5i9z8yspjvj17lbf4jip3sgdh42dqq1v-abseil-cpp-20260817.0/lib/libabsl_random_seed_sequences.so /nix/store/5i9z8yspjvj17lbf4jip3sgdh42dqq1v-abseil-cpp-20260817.0/lib/libabsl_random_internal_entropy_pool.so /nix/store/5i9z8yspjvj17lbf4jip3sgdh42dqq1v-abseil-cpp-20260817.0/lib/libabsl_random_internal_randen.so /nix/store/5i9z8yspjvj17lbf4jip3sgdh42dqq1v-abseil-cpp-20260817.0/lib/libabsl_random_internal_randen_hwaes.so /nix/store/5i9z8yspjvj17lbf4jip3sgdh42dqq1v-abseil-cpp-20260817.0/lib/libabsl_random_internal_randen_hwaes_impl.so /nix/store/5i9z8yspjvj17lbf4jip3sgdh42dqq1v-abseil-cpp-20260817.0/lib/libabsl_random_internal_randen_slow.so /nix/store/5i9z8yspjvj17lbf4jip3sgdh42dqq1v-abseil-cpp-20260817.0/lib/libabsl_random_internal_platform.so /nix/store/5i9z8yspjvj17lbf4jip3sgdh42dqq1v-abseil-cpp-20260817.0/lib/libabsl_random_internal_seed_material.so /nix/store/5i9z8yspjvj17lbf4jip3sgdh42dqq1v-abseil-cpp-20260817.0/lib/libabsl_random_seed_gen_exception.so /nix/store/5i9z8yspjvj17lbf4jip3sgdh42dqq1v-abseil-cpp-20260817.0/lib/libabsl_status.so /nix/store/5i9z8yspjvj17lbf4jip3sgdh42dqq1v-abseil-cpp-20260817.0/lib/libabsl_cord.so /nix/store/5i9z8yspjvj17lbf4jip3sgdh42dqq1v-abseil-cpp-20260817.0/lib/libabsl_cordz_info.so /nix/store/5i9z8yspjvj17lbf4jip3sgdh42dqq1v-abseil-cpp-20260817.0/lib/libabsl_cord_internal.so /nix/store/5i9z8yspjvj17lbf4jip3sgdh42dqq1v-abseil-cpp-20260817.0/lib/libabsl_hash.so /nix/store/5i9z8yspjvj17lbf4jip3sgdh42dqq1v-abseil-cpp-20260817.0/lib/libabsl_city.so /nix/store/5i9z8yspjvj17lbf4jip3sgdh42dqq1v-abseil-cpp-20260817.0/lib/libabsl_cordz_functions.so /nix/store/5i9z8yspjvj17lbf4jip3sgdh42dqq1v-abseil-cpp-20260817.0/lib/libabsl_exponential_biased.so /nix/store/5i9z8yspjvj17lbf4jip3sgdh42dqq1v-abseil-cpp-20260817.0/lib/libabsl_cordz_handle.so /nix/store/5i9z8yspjvj17lbf4jip3sgdh42dqq1v-abseil-cpp-20260817.0/lib/libabsl_crc_cord_state.so /nix/store/5i9z8yspjvj17lbf4jip3sgdh42dqq1v-abseil-cpp-20260817.0/lib/libabsl_crc32c.so /nix/store/5i9z8yspjvj17lbf4jip3sgdh42dqq1v-abseil-cpp-20260817.0/lib/libabsl_crc_internal.so /nix/store/5i9z8yspjvj17lbf4jip3sgdh42dqq1v-abseil-cpp-20260817.0/lib/libabsl_base_cpu_detect.so /nix/store/5i9z8yspjvj17lbf4jip3sgdh42dqq1v-abseil-cpp-20260817.0/lib/libabsl_leak_check.so /nix/store/5i9z8yspjvj17lbf4jip3sgdh42dqq1v-abseil-cpp-20260817.0/lib/libabsl_strerror.so /nix/store/5i9z8yspjvj17lbf4jip3sgdh42dqq1v-abseil-cpp-20260817.0/lib/libabsl_str_format_internal.so /nix/store/5i9z8yspjvj17lbf4jip3sgdh42dqq1v-abseil-cpp-20260817.0/lib/libabsl_synchronization.so /nix/store/5i9z8yspjvj17lbf4jip3sgdh42dqq1v-abseil-cpp-20260817.0/lib/libabsl_graphcycles_internal.so /nix/store/5i9z8yspjvj17lbf4jip3sgdh42dqq1v-abseil-cpp-20260817.0/lib/libabsl_kernel_timeout_internal.so /nix/store/5i9z8yspjvj17lbf4jip3sgdh42dqq1v-abseil-cpp-20260817.0/lib/libabsl_stacktrace.so /nix/store/5i9z8yspjvj17lbf4jip3sgdh42dqq1v-abseil-cpp-20260817.0/lib/libabsl_symbolize.so /nix/store/5i9z8yspjvj17lbf4jip3sgdh42dqq1v-abseil-cpp-20260817.0/lib/libabsl_debugging_internal.so /nix/store/5i9z8yspjvj17lbf4jip3sgdh42dqq1v-abseil-cpp-20260817.0/lib/libabsl_demangle_internal.so /nix/store/5i9z8yspjvj17lbf4jip3sgdh42dqq1v-abseil-cpp-20260817.0/lib/libabsl_demangle_rust.so /nix/store/5i9z8yspjvj17lbf4jip3sgdh42dqq1v-abseil-cpp-20260817.0/lib/libabsl_decode_rust_punycode.so /nix/store/5i9z8yspjvj17lbf4jip3sgdh42dqq1v-abseil-cpp-20260817.0/lib/libabsl_utf8_for_code_point.so /nix/store/5i9z8yspjvj17lbf4jip3sgdh42dqq1v-abseil-cpp-20260817.0/lib/libabsl_malloc_internal.so /nix/store/5i9z8yspjvj17lbf4jip3sgdh42dqq1v-abseil-cpp-20260817.0/lib/libabsl_tracing_internal.so /nix/store/5i9z8yspjvj17lbf4jip3sgdh42dqq1v-abseil-cpp-20260817.0/lib/libabsl_time.so /nix/store/5i9z8yspjvj17lbf4jip3sgdh42dqq1v-abseil-cpp-20260817.0/lib/libabsl_civil_time.so /nix/store/5i9z8yspjvj17lbf4jip3sgdh42dqq1v-abseil-cpp-20260817.0/lib/libabsl_strings.so /nix/store/5i9z8yspjvj17lbf4jip3sgdh42dqq1v-abseil-cpp-20260817.0/lib/libabsl_strings_internal.so /nix/store/5i9z8yspjvj17lbf4jip3sgdh42dqq1v-abseil-cpp-20260817.0/lib/libabsl_hardening.so /nix/store/5i9z8yspjvj17lbf4jip3sgdh42dqq1v-abseil-cpp-20260817.0/lib/libabsl_int128.so /nix/store/5i9z8yspjvj17lbf4jip3sgdh42dqq1v-abseil-cpp-20260817.0/lib/libabsl_base.so -lrt /nix/store/5i9z8yspjvj17lbf4jip3sgdh42dqq1v-abseil-cpp-20260817.0/lib/libabsl_spinlock_wait.so /nix/store/5i9z8yspjvj17lbf4jip3sgdh42dqq1v-abseil-cpp-20260817.0/lib/libabsl_source_location.so /nix/store/5i9z8yspjvj17lbf4jip3sgdh42dqq1v-abseil-cpp-20260817.0/lib/libabsl_throw_delegate.so /nix/store/5i9z8yspjvj17lbf4jip3sgdh42dqq1v-abseil-cpp-20260817.0/lib/libabsl_raw_logging_internal.so /nix/store/5i9z8yspjvj17lbf4jip3sgdh42dqq1v-abseil-cpp-20260817.0/lib/libabsl_log_severity.so /nix/store/5i9z8yspjvj17lbf4jip3sgdh42dqq1v-abseil-cpp-20260817.0/lib/libabsl_time_zone.so /nix/store/hg64psdc3cc5dlrhh8kyksjk3q97g3bk-protobuf-36.2-lib/lib/libprotobuf.so /nix/store/5i9z8yspjvj17lbf4jip3sgdh42dqq1v-abseil-cpp-20260817.0/lib/libabsl_die_if_null.so /nix/store/5i9z8yspjvj17lbf4jip3sgdh42dqq1v-abseil-cpp-20260817.0/lib/libabsl_log_initialize.so /nix/store/hg64psdc3cc5dlrhh8kyksjk3q97g3bk-protobuf-36.2-lib/lib/libutf8_validity.so /nix/store/hg64psdc3cc5dlrhh8kyksjk3q97g3bk-protobuf-36.2-lib/lib/libutf8_range.so /nix/store/37pj113a0sm14a3c8mymvfrm6msfcy82-zstd-1.5.7/lib/libzstd.so -pthread /nix/store/nccqp6jg85jvn979li6mdj6fqp522az4-prometheus-cpp-1.3.0/lib/libprometheus-cpp-core.so /nix/store/nccqp6jg85jvn979li6mdj6fqp522az4-prometheus-cpp-1.3.0/lib/libprometheus-cpp-pull.so /nix/store/q5crci3x6vw32m6qsnbd53fmkvi65llb-nix-util-2.36.0pre20261011_651b0cd5/lib/libnixutil.so /nix/store/6yi5v7iswrvg0hsl8rai9bjrmgfhkhpl-libarchive-3.8.9-lib/lib/libarchive.so /nix/store/w7rygrd3aayxpp6acvz1abxqcirjak6v-nix-store-2.36.0pre20261011_651b0cd5/lib/libnixstore.so /nix/store/d05khq8gbpqw7ykgnjg8qixqyfa1idj5-curl-8.22.0/lib/libcurl.so /nix/store/db07pw9avlwysb3v68cfp9cijg2mmfns-openssl-3.5.8/lib/libcrypto.so /nix/store/hgmz4zqs3swxkxibxbqaqc6bj0xlpqyr-jemalloc-5.3.1/lib/libjemalloc.so -Wl,--end-group151clang++: warning: argument unused during compilation: '-Wa,--compress-debug-sections' [-Wunused-command-line-argument]152mold: error: undefined symbol: _ZN3nix10string2IntITkSt8integralmEESt8optionalIT_ESt17basic_string_viewIcSt11char_traitsIcEE153>>> referenced by options.cc154>>> nix-grpc-daemon.p/src_daemon_options.cc.o:(unsigned long nix::string2IntWithUnitPrefix<unsigned long>(std::basic_string_view<char, std::char_traits<char> >))155clang++: error: linker command failed with exit code 1 (use -v to see invocation)156ninja: build stopped: subcommand failed.