nixbot

builds

failed nix-grpc-store-asan-0.2.0 checks.x86_64-linux.sanitize-smoke · build #646 · raw

1tribuchet: building on jamie
unpackPhase
2unpacking source archive /nix/store/wp1h27i6v32p7azb85j5pnrvbc03fbll-source3source root is source4separate-debug-info: recording checksum of source files for debug support...
configurePhase
5mesonConfigurePhase flags: --prefix=/nix/store/ya7w7k3wm0p6rcm3vqd6d4sv2rv8jch9-nix-grpc-store-asan-0.2.0 --libdir=/nix/store/ya7w7k3wm0p6rcm3vqd6d4sv2rv8jch9-nix-grpc-store-asan-0.2.0/lib --libexecdir=/nix/store/ya7w7k3wm0p6rcm3vqd6d4sv2rv8jch9-nix-grpc-store-asan-0.2.0/libexec --bindir=/nix/store/ya7w7k3wm0p6rcm3vqd6d4sv2rv8jch9-nix-grpc-store-asan-0.2.0/bin --sbindir=/nix/store/ya7w7k3wm0p6rcm3vqd6d4sv2rv8jch9-nix-grpc-store-asan-0.2.0/sbin --includedir=/nix/store/ya7w7k3wm0p6rcm3vqd6d4sv2rv8jch9-nix-grpc-store-asan-0.2.0/include --mandir=/nix/store/ya7w7k3wm0p6rcm3vqd6d4sv2rv8jch9-nix-grpc-store-asan-0.2.0/share/man --infodir=/nix/store/ya7w7k3wm0p6rcm3vqd6d4sv2rv8jch9-nix-grpc-store-asan-0.2.0/share/info --localedir=/nix/store/ya7w7k3wm0p6rcm3vqd6d4sv2rv8jch9-nix-grpc-store-asan-0.2.0/share/locale -Dauto_features=enabled -Dwrap_mode=nodownload --buildtype=plain -Db_sanitize=address\,undefined -Db_lundef=false6The Meson build system7Version: 1.12.18Source dir: /build/source9Build dir: /build/source/build10Build type: native build11WARNING: Project does not target a minimum version but uses feature introduced in '1.1': meson.options file. Use meson_options.txt instead12Project name: nix-grpc-store13Project version: 0.2.014C++ compiler for the host machine: clang++ (clang 21.1.8 "clang version 21.1.8")15C++ linker for the host machine: clang++ ld.bfd 2.4616Host machine cpu family: x86_6417Host machine cpu: x86_6418Found pkg-config: YES (/nix/store/b9izmrfjp0qnnyahdwwrzdwi87s1h179-pkg-config-wrapper-0.29.2/bin/pkg-config) 0.29.219Run-time dependency grpc++ found: YES 1.83.120Run-time dependency protobuf found: YES 36.2.021Run-time dependency libzstd found: YES 1.5.722Run-time dependency threads found: YES23Run-time dependency libcrypto found: YES 3.5.824Run-time dependency prometheus-cpp-core found: YES 1.3.025Run-time dependency prometheus-cpp-pull found: YES 1.3.026Run-time dependency absl_flat_hash_map found: YES 2026081727Run-time dependency absl_hash found: YES 2026081728Run-time dependency absl_synchronization found: YES 2026081729Compiler for C++ supports arguments -Werror=thread-safety: YES 30Run-time dependency nix-store found: YES 2.36.0pre20261011_651b0cd531Run-time dependency nix-util found: YES 2.36.0pre20261011_651b0cd532Run-time dependency jemalloc found: YES 5.3.1_033Run-time dependency libcurl found: YES 8.22.034Run-time dependency nlohmann_json found: YES 3.12.035Check usable header "jwt-cpp/traits/nlohmann-json/defaults.h" : YES 36Program protoc found: YES (/nix/store/icm7gdscsdcbkf1rmnyqhf5vmrdhl6d4-protobuf-36.2/bin/protoc)37Program grpc_cpp_plugin found: YES (/nix/store/5ajs0p0ysy8hynsf1g0b1ggaf1ah3ynj-grpc-1.83.1/bin/grpc_cpp_plugin)38Program mold found: YES (/nix/store/9dcddrfxlfl9n3wfibi5jkmp22bjkvkh-mold-unwrapped-wrapper-2.42.1/bin/mold)39Run-time dependency dl found: YES40Program tests/farm-client-test.sh found: YES (/build/source/tests/farm-client-test.sh)41Program tests/oidc-test.sh found: YES (/build/source/tests/oidc-test.sh)42Build targets in project: 2043WARNING: Project specifies no minimum version but uses features which were added in versions:44 * 1.1: {'meson.options file'}4546nix-grpc-store 0.2.04748 User defined options49 auto_features: enabled50 b_lundef : false51 b_sanitize : address,undefined52 bindir : /nix/store/ya7w7k3wm0p6rcm3vqd6d4sv2rv8jch9-nix-grpc-store-asan-0.2.0/bin53 buildtype : plain54 includedir : /nix/store/ya7w7k3wm0p6rcm3vqd6d4sv2rv8jch9-nix-grpc-store-asan-0.2.0/include55 infodir : /nix/store/ya7w7k3wm0p6rcm3vqd6d4sv2rv8jch9-nix-grpc-store-asan-0.2.0/share/info56 libdir : /nix/store/ya7w7k3wm0p6rcm3vqd6d4sv2rv8jch9-nix-grpc-store-asan-0.2.0/lib57 libexecdir : /nix/store/ya7w7k3wm0p6rcm3vqd6d4sv2rv8jch9-nix-grpc-store-asan-0.2.0/libexec58 localedir : /nix/store/ya7w7k3wm0p6rcm3vqd6d4sv2rv8jch9-nix-grpc-store-asan-0.2.0/share/locale59 mandir : /nix/store/ya7w7k3wm0p6rcm3vqd6d4sv2rv8jch9-nix-grpc-store-asan-0.2.0/share/man60 prefix : /nix/store/ya7w7k3wm0p6rcm3vqd6d4sv2rv8jch9-nix-grpc-store-asan-0.2.061 sbindir : /nix/store/ya7w7k3wm0p6rcm3vqd6d4sv2rv8jch9-nix-grpc-store-asan-0.2.0/sbin62 wrap_mode : nodownload6364Found ninja-1.13.2 at /nix/store/4nsdla28c4177ssp0hlyv5l2yzj8wcba-ninja-1.13.2/bin/ninja65mesonConfigurePhase: enabled\ parallel\ building
buildPhase
66build flags: -j2467[1/65] Generating eds_proto with a custom command68[2/65] Generating nix_remote_proto with a custom command69[3/65] Compiling C++ object plugin-loader-test.p/tests_plugin-loader-test.cc.o70[4/65] Compiling C++ object xfcc-test.p/tests_xfcc-test.cc.o71[5/65] Compiling C++ object nix-grpc-store-loader.so.p/src_client_plugin-loader.cc.o72[6/65] Compiling C++ object sbpl-test.p/tests_sbpl-test.cc.o73[7/65] Compiling C++ object upload-claims-test.p/tests_upload-claims-test.cc.o74[8/65] Compiling C++ object log-spill-test.p/tests_log-spill-test.cc.o75[9/65] Linking target nix-grpc-store-loader.so76clang++: warning: argument unused during compilation: '-Wa,--compress-debug-sections' [-Wunused-command-line-argument]77[10/65] Linking target plugin-loader-test78clang++: warning: argument unused during compilation: '-Wa,--compress-debug-sections' [-Wunused-command-line-argument]79[11/65] Compiling C++ object sbpl-test.p/src_daemon_sbpl.cc.o80[12/65] Linking target log-spill-test81clang++: warning: argument unused during compilation: '-Wa,--compress-debug-sections' [-Wunused-command-line-argument]82[13/65] Linking target upload-claims-test83clang++: warning: argument unused during compilation: '-Wa,--compress-debug-sections' [-Wunused-command-line-argument]84[14/65] Linking target xfcc-test85clang++: warning: argument unused during compilation: '-Wa,--compress-debug-sections' [-Wunused-command-line-argument]86[15/65] Linking target sbpl-test87clang++: warning: argument unused during compilation: '-Wa,--compress-debug-sections' [-Wunused-command-line-argument]88[16/65] Compiling C++ object sandbox-test.p/tests_sandbox-test.cc.o89[17/65] Compiling C++ object upload-spool-test.p/tests_upload-spool-test.cc.o90[18/65] Linking target upload-spool-test91clang++: warning: argument unused during compilation: '-Wa,--compress-debug-sections' [-Wunused-command-line-argument]92[19/65] Compiling C++ object sandbox-test.p/src_daemon_sandbox-linux.cc.o93[20/65] Linking target sandbox-test94clang++: warning: argument unused during compilation: '-Wa,--compress-debug-sections' [-Wunused-command-line-argument]95[21/65] Compiling C++ object libnix-grpc-dispatcher.a.p/meson-generated_.._nix_remote.pb.cc.o96[22/65] Compiling C++ object nar-fetcher-test.p/meson-generated_.._nix_remote.pb.cc.o97[23/65] Compiling C++ object call-test.p/meson-generated_.._nix_remote.pb.cc.o98[24/65] Compiling C++ object scheduler-test.p/tests_scheduler-test.cc.o99[25/65] Linking target scheduler-test100clang++: warning: argument unused during compilation: '-Wa,--compress-debug-sections' [-Wunused-command-line-argument]101[26/65] Precompiling header ../pch/client_pch.hh102[27/65] Compiling C++ object dispatcher-bench.p/tests_dispatcher-bench.cc.o103[28/65] Compiling C++ object scheduler-grpc-bench.p/meson-generated_.._nix_remote.grpc.pb.cc.o104[29/65] Compiling C++ object nar-fetcher-test.p/tests_nar-fetcher-test.cc.o105[30/65] Compiling C++ object nar-fetcher-test.p/meson-generated_.._nix_remote.grpc.pb.cc.o106[31/65] Precompiling header ../pch/daemon_pch.hh107[32/65] Compiling C++ object farm-client-test.p/tests_farm-client-test.cc.o108[33/65] Linking target nar-fetcher-test109clang++: warning: argument unused during compilation: '-Wa,--compress-debug-sections' [-Wunused-command-line-argument]110[34/65] Compiling C++ object call-test.p/tests_call-test.cc.o111[35/65] Compiling C++ object libnix-grpc-dispatcher.a.p/src_daemon_dispatcher.cc.o112[36/65] Compiling C++ object nix-grpc-store.so.p/src_client_channel.cc.o113[37/65] Linking static target libnix-grpc-dispatcher.a114[38/65] Compiling C++ object nix-grpc-daemon.p/meson-generated_.._eds.pb.cc.o115[39/65] Linking target farm-client-test116clang++: warning: argument unused during compilation: '-Wa,--compress-debug-sections' [-Wunused-command-line-argument]117[40/65] Compiling C++ object nix-grpc-daemon.p/src_client_channel.cc.o118[41/65] Compiling C++ object nix-grpc-store.so.p/meson-generated_.._nix_remote.pb.cc.o119[42/65] Compiling C++ object scheduler-grpc-bench.p/tests_scheduler-grpc-bench.cc.o120[43/65] Compiling C++ object nix-grpc-daemon.p/meson-generated_.._eds.grpc.pb.cc.o121[44/65] Linking target dispatcher-bench122clang++: warning: argument unused during compilation: '-Wa,--compress-debug-sections' [-Wunused-command-line-argument]123[45/65] Compiling C++ object nix-grpc-daemon.p/meson-generated_.._nix_remote.pb.cc.o124[46/65] Linking target scheduler-grpc-bench125clang++: warning: argument unused during compilation: '-Wa,--compress-debug-sections' [-Wunused-command-line-argument]126[47/65] Compiling C++ object nix-grpc-daemon.p/src_daemon_sandbox-linux.cc.o127[48/65] Compiling C++ object oidc-test.p/tests_oidc-test.cc.o128[49/65] Compiling C++ object call-test.p/meson-generated_.._nix_remote.grpc.pb.cc.o129[50/65] Compiling C++ object nix-grpc-daemon.p/src_daemon_backend.cc.o130[51/65] Compiling C++ object nix-grpc-store.so.p/meson-generated_.._nix_remote.grpc.pb.cc.o131[52/65] Linking target oidc-test132clang++: warning: argument unused during compilation: '-Wa,--compress-debug-sections' [-Wunused-command-line-argument]133[53/65] Compiling C++ object nix-grpc-daemon.p/src_daemon_elector.cc.o134[54/65] Linking target call-test135clang++: warning: argument unused during compilation: '-Wa,--compress-debug-sections' [-Wunused-command-line-argument]136[55/65] Compiling C++ object nix-grpc-daemon.p/meson-generated_.._nix_remote.grpc.pb.cc.o137[56/65] Compiling C++ object nix-grpc-daemon.p/src_daemon_options.cc.o138[57/65] Compiling C++ object nix-grpc-store.so.p/src_client_store.cc.o139[58/65] Compiling C++ object nix-grpc-daemon.p/src_daemon_eds.cc.o140[59/65] Compiling C++ object nix-grpc-store.so.p/src_client_transfer.cc.o141[60/65] Compiling C++ object nix-grpc-daemon.p/src_daemon_auth.cc.o142[61/65] Compiling C++ object nix-grpc-store.so.p/src_client_build.cc.o143[62/65] Linking target nix-grpc-store.so144clang++: warning: argument unused during compilation: '-Wa,--compress-debug-sections' [-Wunused-command-line-argument]145[63/65] Compiling C++ object nix-grpc-daemon.p/src_daemon_coordinator.cc.o146[64/65] Compiling C++ object nix-grpc-daemon.p/src_daemon_main.cc.o147[65/65] Linking target nix-grpc-daemon148FAILED: [code=1] nix-grpc-daemon 149clang++ -o nix-grpc-daemon nix-grpc-daemon.p/meson-generated_.._nix_remote.pb.cc.o nix-grpc-daemon.p/meson-generated_.._nix_remote.grpc.pb.cc.o nix-grpc-daemon.p/meson-generated_.._eds.pb.cc.o nix-grpc-daemon.p/meson-generated_.._eds.grpc.pb.cc.o nix-grpc-daemon.p/src_daemon_main.cc.o nix-grpc-daemon.p/src_client_channel.cc.o nix-grpc-daemon.p/src_daemon_elector.cc.o nix-grpc-daemon.p/src_daemon_auth.cc.o nix-grpc-daemon.p/src_daemon_backend.cc.o nix-grpc-daemon.p/src_daemon_coordinator.cc.o nix-grpc-daemon.p/src_daemon_eds.cc.o nix-grpc-daemon.p/src_daemon_options.cc.o nix-grpc-daemon.p/src_daemon_sandbox-linux.cc.o -fsanitize=address,undefined -Wl,--as-needed -Wl,--allow-shlib-undefined -fuse-ld=mold -Wl,--start-group libnix-grpc-dispatcher.a /nix/store/5ajs0p0ysy8hynsf1g0b1ggaf1ah3ynj-grpc-1.83.1/lib/libgrpc++.so /nix/store/5ajs0p0ysy8hynsf1g0b1ggaf1ah3ynj-grpc-1.83.1/lib/libgrpc.so /nix/store/7572x9sh546lh8lvj2wg67147mib845b-abseil-cpp-20260817.0/lib/libabsl_statusor.so /nix/store/5ajs0p0ysy8hynsf1g0b1ggaf1ah3ynj-grpc-1.83.1/lib/libgpr.so /nix/store/7572x9sh546lh8lvj2wg67147mib845b-abseil-cpp-20260817.0/lib/libabsl_log_internal_check_op.so /nix/store/7572x9sh546lh8lvj2wg67147mib845b-abseil-cpp-20260817.0/lib/libabsl_flags_internal.so /nix/store/7572x9sh546lh8lvj2wg67147mib845b-abseil-cpp-20260817.0/lib/libabsl_flags_reflection.so /nix/store/7572x9sh546lh8lvj2wg67147mib845b-abseil-cpp-20260817.0/lib/libabsl_flags_private_handle_accessor.so /nix/store/7572x9sh546lh8lvj2wg67147mib845b-abseil-cpp-20260817.0/lib/libabsl_flags_commandlineflag.so /nix/store/7572x9sh546lh8lvj2wg67147mib845b-abseil-cpp-20260817.0/lib/libabsl_flags_commandlineflag_internal.so /nix/store/7572x9sh546lh8lvj2wg67147mib845b-abseil-cpp-20260817.0/lib/libabsl_flags_config.so /nix/store/7572x9sh546lh8lvj2wg67147mib845b-abseil-cpp-20260817.0/lib/libabsl_flags_program_name.so /nix/store/7572x9sh546lh8lvj2wg67147mib845b-abseil-cpp-20260817.0/lib/libabsl_raw_hash_set.so /nix/store/7572x9sh546lh8lvj2wg67147mib845b-abseil-cpp-20260817.0/lib/libabsl_hashtablez_sampler.so /nix/store/7572x9sh546lh8lvj2wg67147mib845b-abseil-cpp-20260817.0/lib/libabsl_flags_marshalling.so /nix/store/7572x9sh546lh8lvj2wg67147mib845b-abseil-cpp-20260817.0/lib/libabsl_log_internal_conditions.so /nix/store/7572x9sh546lh8lvj2wg67147mib845b-abseil-cpp-20260817.0/lib/libabsl_log_internal_message.so /nix/store/7572x9sh546lh8lvj2wg67147mib845b-abseil-cpp-20260817.0/lib/libabsl_examine_stack.so /nix/store/7572x9sh546lh8lvj2wg67147mib845b-abseil-cpp-20260817.0/lib/libabsl_log_internal_format.so /nix/store/7572x9sh546lh8lvj2wg67147mib845b-abseil-cpp-20260817.0/lib/libabsl_log_internal_nullguard.so /nix/store/7572x9sh546lh8lvj2wg67147mib845b-abseil-cpp-20260817.0/lib/libabsl_log_internal_structured_proto.so /nix/store/7572x9sh546lh8lvj2wg67147mib845b-abseil-cpp-20260817.0/lib/libabsl_log_internal_log_sink_set.so /nix/store/7572x9sh546lh8lvj2wg67147mib845b-abseil-cpp-20260817.0/lib/libabsl_log_internal_globals.so /nix/store/7572x9sh546lh8lvj2wg67147mib845b-abseil-cpp-20260817.0/lib/libabsl_log_sink.so /nix/store/7572x9sh546lh8lvj2wg67147mib845b-abseil-cpp-20260817.0/lib/libabsl_log_entry.so /nix/store/7572x9sh546lh8lvj2wg67147mib845b-abseil-cpp-20260817.0/lib/libabsl_log_internal_proto.so /nix/store/7572x9sh546lh8lvj2wg67147mib845b-abseil-cpp-20260817.0/lib/libabsl_log_globals.so /nix/store/7572x9sh546lh8lvj2wg67147mib845b-abseil-cpp-20260817.0/lib/libabsl_vlog_config_internal.so /nix/store/7572x9sh546lh8lvj2wg67147mib845b-abseil-cpp-20260817.0/lib/libabsl_log_internal_fnmatch.so /nix/store/7572x9sh546lh8lvj2wg67147mib845b-abseil-cpp-20260817.0/lib/libabsl_random_distributions.so /nix/store/7572x9sh546lh8lvj2wg67147mib845b-abseil-cpp-20260817.0/lib/libabsl_random_seed_sequences.so /nix/store/7572x9sh546lh8lvj2wg67147mib845b-abseil-cpp-20260817.0/lib/libabsl_random_internal_entropy_pool.so /nix/store/7572x9sh546lh8lvj2wg67147mib845b-abseil-cpp-20260817.0/lib/libabsl_random_internal_randen.so /nix/store/7572x9sh546lh8lvj2wg67147mib845b-abseil-cpp-20260817.0/lib/libabsl_random_internal_randen_hwaes.so /nix/store/7572x9sh546lh8lvj2wg67147mib845b-abseil-cpp-20260817.0/lib/libabsl_random_internal_randen_hwaes_impl.so /nix/store/7572x9sh546lh8lvj2wg67147mib845b-abseil-cpp-20260817.0/lib/libabsl_random_internal_randen_slow.so /nix/store/7572x9sh546lh8lvj2wg67147mib845b-abseil-cpp-20260817.0/lib/libabsl_random_internal_platform.so /nix/store/7572x9sh546lh8lvj2wg67147mib845b-abseil-cpp-20260817.0/lib/libabsl_random_internal_seed_material.so /nix/store/7572x9sh546lh8lvj2wg67147mib845b-abseil-cpp-20260817.0/lib/libabsl_random_seed_gen_exception.so /nix/store/7572x9sh546lh8lvj2wg67147mib845b-abseil-cpp-20260817.0/lib/libabsl_status.so /nix/store/7572x9sh546lh8lvj2wg67147mib845b-abseil-cpp-20260817.0/lib/libabsl_cord.so /nix/store/7572x9sh546lh8lvj2wg67147mib845b-abseil-cpp-20260817.0/lib/libabsl_cordz_info.so /nix/store/7572x9sh546lh8lvj2wg67147mib845b-abseil-cpp-20260817.0/lib/libabsl_cord_internal.so /nix/store/7572x9sh546lh8lvj2wg67147mib845b-abseil-cpp-20260817.0/lib/libabsl_hash.so /nix/store/7572x9sh546lh8lvj2wg67147mib845b-abseil-cpp-20260817.0/lib/libabsl_city.so /nix/store/7572x9sh546lh8lvj2wg67147mib845b-abseil-cpp-20260817.0/lib/libabsl_cordz_functions.so /nix/store/7572x9sh546lh8lvj2wg67147mib845b-abseil-cpp-20260817.0/lib/libabsl_exponential_biased.so /nix/store/7572x9sh546lh8lvj2wg67147mib845b-abseil-cpp-20260817.0/lib/libabsl_cordz_handle.so /nix/store/7572x9sh546lh8lvj2wg67147mib845b-abseil-cpp-20260817.0/lib/libabsl_crc_cord_state.so /nix/store/7572x9sh546lh8lvj2wg67147mib845b-abseil-cpp-20260817.0/lib/libabsl_crc32c.so /nix/store/7572x9sh546lh8lvj2wg67147mib845b-abseil-cpp-20260817.0/lib/libabsl_crc_internal.so /nix/store/7572x9sh546lh8lvj2wg67147mib845b-abseil-cpp-20260817.0/lib/libabsl_base_cpu_detect.so /nix/store/7572x9sh546lh8lvj2wg67147mib845b-abseil-cpp-20260817.0/lib/libabsl_leak_check.so /nix/store/7572x9sh546lh8lvj2wg67147mib845b-abseil-cpp-20260817.0/lib/libabsl_strerror.so /nix/store/7572x9sh546lh8lvj2wg67147mib845b-abseil-cpp-20260817.0/lib/libabsl_str_format_internal.so /nix/store/7572x9sh546lh8lvj2wg67147mib845b-abseil-cpp-20260817.0/lib/libabsl_synchronization.so /nix/store/7572x9sh546lh8lvj2wg67147mib845b-abseil-cpp-20260817.0/lib/libabsl_graphcycles_internal.so /nix/store/7572x9sh546lh8lvj2wg67147mib845b-abseil-cpp-20260817.0/lib/libabsl_kernel_timeout_internal.so /nix/store/7572x9sh546lh8lvj2wg67147mib845b-abseil-cpp-20260817.0/lib/libabsl_stacktrace.so /nix/store/7572x9sh546lh8lvj2wg67147mib845b-abseil-cpp-20260817.0/lib/libabsl_symbolize.so /nix/store/7572x9sh546lh8lvj2wg67147mib845b-abseil-cpp-20260817.0/lib/libabsl_debugging_internal.so /nix/store/7572x9sh546lh8lvj2wg67147mib845b-abseil-cpp-20260817.0/lib/libabsl_demangle_internal.so /nix/store/7572x9sh546lh8lvj2wg67147mib845b-abseil-cpp-20260817.0/lib/libabsl_demangle_rust.so /nix/store/7572x9sh546lh8lvj2wg67147mib845b-abseil-cpp-20260817.0/lib/libabsl_decode_rust_punycode.so /nix/store/7572x9sh546lh8lvj2wg67147mib845b-abseil-cpp-20260817.0/lib/libabsl_utf8_for_code_point.so /nix/store/7572x9sh546lh8lvj2wg67147mib845b-abseil-cpp-20260817.0/lib/libabsl_malloc_internal.so /nix/store/7572x9sh546lh8lvj2wg67147mib845b-abseil-cpp-20260817.0/lib/libabsl_tracing_internal.so /nix/store/7572x9sh546lh8lvj2wg67147mib845b-abseil-cpp-20260817.0/lib/libabsl_time.so /nix/store/7572x9sh546lh8lvj2wg67147mib845b-abseil-cpp-20260817.0/lib/libabsl_civil_time.so /nix/store/7572x9sh546lh8lvj2wg67147mib845b-abseil-cpp-20260817.0/lib/libabsl_strings.so /nix/store/7572x9sh546lh8lvj2wg67147mib845b-abseil-cpp-20260817.0/lib/libabsl_strings_internal.so /nix/store/7572x9sh546lh8lvj2wg67147mib845b-abseil-cpp-20260817.0/lib/libabsl_hardening.so /nix/store/7572x9sh546lh8lvj2wg67147mib845b-abseil-cpp-20260817.0/lib/libabsl_int128.so /nix/store/7572x9sh546lh8lvj2wg67147mib845b-abseil-cpp-20260817.0/lib/libabsl_base.so -lrt /nix/store/7572x9sh546lh8lvj2wg67147mib845b-abseil-cpp-20260817.0/lib/libabsl_spinlock_wait.so /nix/store/7572x9sh546lh8lvj2wg67147mib845b-abseil-cpp-20260817.0/lib/libabsl_source_location.so /nix/store/7572x9sh546lh8lvj2wg67147mib845b-abseil-cpp-20260817.0/lib/libabsl_throw_delegate.so /nix/store/7572x9sh546lh8lvj2wg67147mib845b-abseil-cpp-20260817.0/lib/libabsl_raw_logging_internal.so /nix/store/7572x9sh546lh8lvj2wg67147mib845b-abseil-cpp-20260817.0/lib/libabsl_log_severity.so /nix/store/7572x9sh546lh8lvj2wg67147mib845b-abseil-cpp-20260817.0/lib/libabsl_time_zone.so /nix/store/j5lvxgp42xsmnl2wir5ikm4xhsh01jhp-protobuf-36.2-lib/lib/libprotobuf.so /nix/store/7572x9sh546lh8lvj2wg67147mib845b-abseil-cpp-20260817.0/lib/libabsl_die_if_null.so /nix/store/7572x9sh546lh8lvj2wg67147mib845b-abseil-cpp-20260817.0/lib/libabsl_log_initialize.so /nix/store/j5lvxgp42xsmnl2wir5ikm4xhsh01jhp-protobuf-36.2-lib/lib/libutf8_validity.so /nix/store/j5lvxgp42xsmnl2wir5ikm4xhsh01jhp-protobuf-36.2-lib/lib/libutf8_range.so /nix/store/ph4ib8mxy5yrw40k7a1l03bfd58hq6wj-zstd-1.5.7/lib/libzstd.so -pthread /nix/store/mfhfwdx3nknbwwgnp1njnzhhikph7dsa-prometheus-cpp-1.3.0/lib/libprometheus-cpp-core.so /nix/store/mfhfwdx3nknbwwgnp1njnzhhikph7dsa-prometheus-cpp-1.3.0/lib/libprometheus-cpp-pull.so /nix/store/bf8zn38v84ji0h49qh6048mlqmchy0da-nix-util-2.36.0pre20261011_651b0cd5/lib/libnixutil.so /nix/store/xjn862icpw4y48i3mnyl2bgxx30fsjbp-libarchive-3.8.9-lib/lib/libarchive.so /nix/store/3h5cd0lzj4s4r4vg7vpsqcqpqisgyg34-nix-store-2.36.0pre20261011_651b0cd5/lib/libnixstore.so /nix/store/36alc2mwna4nzf6djdj2hvh4w4r3cai5-curl-8.22.0/lib/libcurl.so /nix/store/cxd8d2vg70c3pa31v2473hphaa1v0j44-openssl-3.5.8/lib/libcrypto.so /nix/store/zbc3ys9xswbj274v652nf0c9xifdi9dw-jemalloc-5.3.1/lib/libjemalloc.so -Wl,--end-group150clang++: warning: argument unused during compilation: '-Wa,--compress-debug-sections' [-Wunused-command-line-argument]151mold: error: undefined symbol: _ZN3nix10string2IntITkSt8integralmEESt8optionalIT_ESt17basic_string_viewIcSt11char_traitsIcEE152>>> referenced by options.cc153>>> nix-grpc-daemon.p/src_daemon_options.cc.o:(unsigned long nix::string2IntWithUnitPrefix<unsigned long>(std::basic_string_view<char, std::char_traits<char> >))154clang++: error: linker command failed with exit code 1 (use -v to see invocation)155ninja: build stopped: subcommand failed.