nixbot

builds

Mic92/nix-grpc-store build #648 failed

branch main · PR #195 · commit 4ac62a311a · · took 4m 42s · eval 20s

7 failed
failed attributes
status attribute duration
failed checks.aarch64-darwin.clang-tidy 1m 27s
nix-grpc-store-clang-tidy-0.2.0: 79 | if (!ks.empty() && std::ranges::all_of(ks, [&](const K & k) -> bool { return valid.contains(k); })) { …
nix-grpc-store-clang-tidy-0.2.0:
   79 |             if (!ks.empty() && std::ranges::all_of(ks, [&](const K & k) -> bool { return valid.contains(k); })) {
      |                                                                      ^
../src/top-down.hh:83:25: error: variable name 'c' is too short, expected at least 3 characters [readability-identifier-length,-warnings-as-errors]
   83 |             for (auto & c : children(n)) {
      |                         ^
FAILED: [code=1] meson-internal__clang-tidy 
/nix/store/yjl5dwm08zmfsjrqyidrvcgm59qlgmxz-meson-1.12.1/bin/meson --internal clangtidy /private/var/tb/4/scratch/fe32ff854eb50a17/build/source /private/var/tb/4/scratch/fe32ff854eb50a17/build/source/build --color always
ninja: build stopped: subcommand failed.
failed checks.aarch64-linux.clang-tidy 1m 49s
nix-grpc-store-clang-tidy-0.2.0: 79 | if (!ks.empty() && std::ranges::all_of(ks, [&](const K & k) -> bool { return valid.contains(k); })) { …
nix-grpc-store-clang-tidy-0.2.0:
   79 |             if (!ks.empty() && std::ranges::all_of(ks, [&](const K & k) -> bool { return valid.contains(k); })) {
      |                                                                      ^
../src/top-down.hh:83:25: error: variable name 'c' is too short, expected at least 3 characters [readability-identifier-length,-warnings-as-errors]
   83 |             for (auto & c : children(n)) {
      |                         ^
FAILED: [code=1] meson-internal__clang-tidy 
/nix/store/av7nrlz2yrbwwn4xmpdaz0swnqp36j1f-meson-1.12.1/bin/meson --internal clangtidy /build/source /build/source/build --color always
ninja: build stopped: subcommand failed.
failed checks.aarch64-linux.farm 2m 26s
vm-test-run-nix-grpc-farm: worker2 # [ 94.556806] nix-grpc-daemon[804]: ts=2026-10-12T08:33:42Z level=info event=scheduler_connected addr=lb:50051 worker2 # [ …
vm-test-run-nix-grpc-farm:
worker2 # [   94.556806] nix-grpc-daemon[804]: ts=2026-10-12T08:33:42Z level=info event=scheduler_connected addr=lb:50051
worker2 # [   94.561247] nix-grpc-daemon[804]: ts=2026-10-12T08:33:42Z level=info event=scheduler_disconnected addr=lb:50051 error="no healthy upstream"
lb # [   94.645005] sshd-session[1524]: pam_unix(sshd:auth): user [root] has blank password; authenticated without it
lb # [   94.653602] sshd-session[1524]: Accepted none for root from UNKNOWN port 65535 ssh2
lb # [   94.662377] sshd-session[1524]: pam_unix(sshd:session): session opened for user root(uid=0) by (uid=0)
lb # [   94.670995] systemd-logind[510]: New session '43' of user 'root' with class 'user' and type 'tty'.
lb # [   94.676435] systemd[1]: Started Session 43 of User root.
tribuchet: remote build failed: no connected worker builds for system aarch64-linux
failed checks.x86_64-linux.clang-tidy 57s
nix-grpc-store-clang-tidy-0.2.0: 79 | if (!ks.empty() && std::ranges::all_of(ks, [&](const K & k) -> bool { return valid.contains(k); })) { …
nix-grpc-store-clang-tidy-0.2.0:
   79 |             if (!ks.empty() && std::ranges::all_of(ks, [&](const K & k) -> bool { return valid.contains(k); })) {
      |                                                                      ^
../src/top-down.hh:83:25: error: variable name 'c' is too short, expected at least 3 characters [readability-identifier-length,-warnings-as-errors]
   83 |             for (auto & c : children(n)) {
      |                         ^
FAILED: [code=1] meson-internal__clang-tidy 
/nix/store/r72868g8znkk4m8pmwsn3cf8v3h84mr0-meson-1.12.1/bin/meson --internal clangtidy /build/source /build/source/build --color always
ninja: build stopped: subcommand failed.
failed checks.x86_64-linux.farm 3m 15s
vm-test-run-nix-grpc-farm: worker2 # [ 128.532252] sshd-session[1945]: pam_unix(sshd:session): session closed for user root worker2 # [ 128.535322] systemd[1] …
vm-test-run-nix-grpc-farm:
worker2 # [  128.532252] sshd-session[1945]: pam_unix(sshd:session): session closed for user root
worker2 # [  128.535322] systemd[1]: sshd-vsock@35-36-6:22-2:35.service: Deactivated successfully.
worker2 # [  128.539911] systemd[1]: session-40.scope: Deactivated successfully.
worker2 # [  128.541415] systemd[1]: session-40.scope: Consumed 15ms CPU time over 35ms wall clock time, 3.1M memory peak, 5.3K incoming IP traffic, 457B outgoing IP traffic.
worker2 # [  128.544378] systemd-logind[548]: Session 40 logged out. Waiting for processes to exit.
worker2 # [  128.547116] systemd-logind[548]: Removed session 40.
worker1 # [  128.565866] systemd[1]: SSH Host Keys Generation skipped, no trigger condition checks were met.
tribuchet: remote build failed: no connected worker builds for system x86_64-linux
failed checks.x86_64-linux.k3s 3m 15s
vm-test-run-nix-grpc-farm-k3s: machine # [ 30.041932] k3s[852]: time="2026-10-12T08:33:16Z" level=info msg="Event occurred" apiVersion=k3s.cattle.io/v1 fieldP …
vm-test-run-nix-grpc-farm-k3s:
machine # [   30.041932] k3s[852]: time="2026-10-12T08:33:16Z" level=info msg="Event occurred" apiVersion=k3s.cattle.io/v1 fieldPath= kind=Addon logger=k3s/deploy message="Applied manifest at \"/var/lib/rancher/k3s/server/manifests/runtimes.yaml\"" object=kube-system/runtimes reason=AppliedManifest type=Normal
machine # [   30.242946] k3s[852]: I1012 08:33:16.841154     852 controller.go:667] quota admission added evaluator for: replicasets.apps
machine # [   30.245411] k3s[852]: time="2026-10-12T08:33:16Z" level=info msg="Event occurred" apiVersion=k3s.cattle.io/v1 fieldPath= kind=Addon logger=k3s/deploy message="Deleting manifest at \"/var/lib/rancher/k3s/server/manifests/traefik.yaml\"" object=kube-system/traefik reason=DeletingManifest type=Normal
machine # [   30.359301] k3s[852]: time="2026-10-12T08:33:16Z" level=info msg="Event occurred" apiVersion=helm.cattle.io/v1 fieldPath= kind=HelmChart logger=k3s/helm-controller message="Resumed synced Job kube-system/helm-install-nix-grpc-farm" object=kube-system/nix-grpc-farm reason=ResumeJob type=Normal
machine # Error from server (NotFound): deployments.apps "nix-grpc-farm-lb" not found
machine # [   30.599769] k3s[852]: E1012 08:33:17.197942     852 replica_set.go:640] "Unhandled Error" err="sync \"kube-system/coredns-54996dc9b4\" failed with read version: 344 is not as new as written version: 367 for group resource replicasets.apps" logger="UnhandledError"
machine # [   30.606497] k3s[852]: E1012 08:33:17.204720     852 replica_set.go:640] "Unhandled Error" err="sync \"kube-system/coredns-54996dc9b4\" failed with read version: 367 is not as new as written version: 368 for group resource replicasets.apps" logger="UnhandledError"
tribuchet: remote build failed: no connected worker builds for system x86_64-linux
failed checks.x86_64-linux.vm 3m 15s
vm-test-run-nix-grpc-store-main: machine # [ 132.179525] sshd-session[4524]: pam_unix(sshd:session): session closed for user root machine # [ 132.181552] syst …
vm-test-run-nix-grpc-store-main:
machine # [  132.179525] sshd-session[4524]: pam_unix(sshd:session): session closed for user root
machine # [  132.181552] systemd[1]: sshd-vsock@221-136-3:22-2:221.service: Deactivated successfully.
machine # [  132.184639] systemd[1]: session-226.scope: Deactivated successfully.
machine # [  132.186614] systemd-logind[582]: Session 226 logged out. Waiting for processes to exit.
machine # [  132.188139] systemd-logind[582]: Removed session 226.
machine # [  132.201354] systemd[1]: SSH Host Keys Generation skipped, no trigger condition checks were met.
machine # [  132.204836] systemd[1]: Started SSH per-connection Daemon (vsock:2:222).
tribuchet: remote build failed: no connected worker builds for system x86_64-linux
1 cancelled
cancelled attributes
status attribute duration
loading…
29 succeeded
succeeded attributes
status attribute duration
loading…
5 already built
skipped attributes
status attribute duration
loading…