nixbot

builds

Mic92/nix-grpc-store build #649 failed

branch main · PR #195 · commit 4c2ce55af2 · · took 13m 12s · eval 20s

3 failed
failed attributes
status attribute duration
failed checks.aarch64-darwin.clang-tidy 1m 46s
nix-grpc-store-clang-tidy-0.2.0: 79 | if (!ks.empty() && std::ranges::all_of(ks, [&](const K & k) -> bool { return valid.contains(k); })) { …
nix-grpc-store-clang-tidy-0.2.0:
   79 |             if (!ks.empty() && std::ranges::all_of(ks, [&](const K & k) -> bool { return valid.contains(k); })) {
      |                                                                      ^
../src/top-down.hh:83:25: error: variable name 'c' is too short, expected at least 3 characters [readability-identifier-length,-warnings-as-errors]
   83 |             for (auto & c : children(n)) {
      |                         ^
FAILED: [code=1] meson-internal__clang-tidy 
/nix/store/yjl5dwm08zmfsjrqyidrvcgm59qlgmxz-meson-1.12.1/bin/meson --internal clangtidy /private/var/tb/3/scratch/b484b9905da928ec/build/source /private/var/tb/3/scratch/b484b9905da928ec/build/source/build --color always
ninja: build stopped: subcommand failed.
failed checks.aarch64-linux.clang-tidy 1m 57s
nix-grpc-store-clang-tidy-0.2.0: 79 | if (!ks.empty() && std::ranges::all_of(ks, [&](const K & k) -> bool { return valid.contains(k); })) { …
nix-grpc-store-clang-tidy-0.2.0:
   79 |             if (!ks.empty() && std::ranges::all_of(ks, [&](const K & k) -> bool { return valid.contains(k); })) {
      |                                                                      ^
../src/top-down.hh:83:25: error: variable name 'c' is too short, expected at least 3 characters [readability-identifier-length,-warnings-as-errors]
   83 |             for (auto & c : children(n)) {
      |                         ^
FAILED: [code=1] meson-internal__clang-tidy 
/nix/store/av7nrlz2yrbwwn4xmpdaz0swnqp36j1f-meson-1.12.1/bin/meson --internal clangtidy /build/source /build/source/build --color always
ninja: build stopped: subcommand failed.
failed checks.x86_64-linux.clang-tidy 56s
nix-grpc-store-clang-tidy-0.2.0: 79 | if (!ks.empty() && std::ranges::all_of(ks, [&](const K & k) -> bool { return valid.contains(k); })) { …
nix-grpc-store-clang-tidy-0.2.0:
   79 |             if (!ks.empty() && std::ranges::all_of(ks, [&](const K & k) -> bool { return valid.contains(k); })) {
      |                                                                      ^
../src/top-down.hh:83:25: error: variable name 'c' is too short, expected at least 3 characters [readability-identifier-length,-warnings-as-errors]
   83 |             for (auto & c : children(n)) {
      |                         ^
FAILED: [code=1] meson-internal__clang-tidy 
/nix/store/r72868g8znkk4m8pmwsn3cf8v3h84mr0-meson-1.12.1/bin/meson --internal clangtidy /build/source /build/source/build --color always
ninja: build stopped: subcommand failed.
34 succeeded
succeeded attributes
status attribute duration
loading…
5 already built
skipped attributes
status attribute duration
loading…