setup
checks.aarch64-darwin.exit-stress
· build #662
· raw
1these 32 derivations will be built:2 /nix/store/8n8d3fj7v718vkkkwbw03j9sj3dr94wq-nix-util-2.36.0pre20261018_9d8ebdb5.drv3 /nix/store/1r4n7j4gan8nkz0wcky3zwx7arr0xfxv-nix-store-2.36.0pre20261018_9d8ebdb5.drv4 /nix/store/k18xa5ahazbc9glqckm758c0fiq85n1s-nix-util-c-2.36.0pre20261018_9d8ebdb5.drv5 /nix/store/frqrrs9f7w3h1phqp42v1c99v8mfvgv2-nix-store-c-2.36.0pre20261018_9d8ebdb5.drv6 /nix/store/sxswxcg4dwl7y16035926j1jmvhi14zh-nix-fetchers-2.36.0pre20261018_9d8ebdb5.drv7 /nix/store/ns3p2mchch2i1fyl43ns0bx9g791pgqy-nix-expr-2.36.0pre20261018_9d8ebdb5.drv8 /nix/store/r0nz7887a4gl6vicadrn8q09101nlgpx-nix-expr-c-2.36.0pre20261018_9d8ebdb5.drv9 /nix/store/iq22zibnqx1w1b24clrf26hlffr2v3zj-nix-fetchers-c-2.36.0pre20261018_9d8ebdb5.drv10 /nix/store/l2ba575gxvbkidmbqv924iqplm7ms8cp-nix-util-test-support-2.36.0pre20261018_9d8ebdb5.drv11 /nix/store/rn9sdkyjy6dnm6m35fg1civjaj64s5xx-nix-store-test-support-2.36.0pre20261018_9d8ebdb5.drv12 /nix/store/0az21m86k1mia9khjxm32g607n3fh1xz-nix-fetchers-tests-2.36.0pre20261018_9d8ebdb5.drv13 /nix/store/28n0ym8pf66srnbzi896xlk4yraxvvl3-nix-grpc-store-0.2.0.drv14 /nix/store/2r31r5j00d83sqcq2k7z0yx9maxba76c-nix-store-tests-2.36.0pre20261018_9d8ebdb5.drv15 /nix/store/g0bpgzapwf5invb660y4dagqg5x40pgg-nix-util-tests-2.36.0pre20261018_9d8ebdb5.drv16 /nix/store/3kvzh0spg1vdfv378a36vz5577i9g8w8-nix-util-tests-run.drv17 /nix/store/iq0my9489y218wr7fh9jw34dqn8v3hva-nix-flake-2.36.0pre20261018_9d8ebdb5.drv18 /nix/store/7r36kj15ffdjhzxi5dxiblqzxbcwj7w2-nix-flake-c-2.36.0pre20261018_9d8ebdb5.drv19 /nix/store/wd2449vj342s3c1qj2hbvrpsy5cnnhri-nix-main-2.36.0pre20261018_9d8ebdb5.drv20 /nix/store/vv4nnj28vkm8r8p2kwzarif41ip0c9m4-nix-main-c-2.36.0pre20261018_9d8ebdb5.drv21 /nix/store/z1bmwal2n88j6d2xkn6fccm50ncg0jhl-nix-cmd-2.36.0pre20261018_9d8ebdb5.drv22 /nix/store/db2pv94iycvvr6n3q1sirnixf893v66p-nix-2.36.0pre20261018_9d8ebdb5.drv23 /nix/store/74fdp7wy93aa9h06w6x71ibd6mjpcd16-nix-functional-tests-2.36.0pre20261018_9d8ebdb5.drv24 /nix/store/dasp5nlimakbq67wx1ndxxnk16p18pvy-nix-util-test-support-2.36.0pre20261018_9d8ebdb5.drv25 /nix/store/kcfxzksh0gj8ci9djvivymlf8iwhkh49-nix-expr-tests-2.36.0pre20261018_9d8ebdb5.drv26 /nix/store/9k2hmd7g965dblib0x2c7zzxqr6jqx3r-nix-expr-tests-run.drv27 /nix/store/i7k0q0z1grv08bzdsv63csna2p7rrzvy-nix-flake-tests-2.36.0pre20261018_9d8ebdb5.drv28 /nix/store/df2lxzax51y346y4bqn01ihahc2lf0pg-nix-flake-tests-run.drv29 /nix/store/j42027ckik1cxzrl9pagy2px8qch0m7q-nix-store-tests-run.drv30 /nix/store/w5jzrpxddkvmwz7v6kwf9lja5ghaaj26-nix-manual-2.36.0pre20261018_9d8ebdb5.drv31 /nix/store/xb0zdrb86gq0r9fqc028pmx3idpq4ldg-nix-fetchers-tests-run.drv32 /nix/store/5qam262gikv7nl8pmw8dcd6dihm8lza8-nix-2.36.0pre20261018_9d8ebdb5.drv33 /nix/store/dqg1lmg4y9nrx9szms3a1rdljgi0s2wr-nix-grpc-store-exit-stress.drv34error: Cannot build '/nix/store/3kvzh0spg1vdfv378a36vz5577i9g8w8-nix-util-tests-run.drv'.35 Reason: builder failed with exit code 1.36 Output paths:37 /nix/store/im66j9iajja86kqhjcxxy9734gabkk56-nix-util-tests-run38 Last 25 log lines:39 > [ RUN ] Unix/UrlPathTest.urlPathToPath/root_path40 > [ OK ] Unix/UrlPathTest.urlPathToPath/root_path (0 ms)41 > [ RUN ] Unix/UrlPathTest.urlToString/absolute_path42 > [ OK ] Unix/UrlPathTest.urlToString/absolute_path (0 ms)43 > [ RUN ] Unix/UrlPathTest.urlToString/root_path44 > [ OK ] Unix/UrlPathTest.urlToString/root_path (0 ms)45 > [ RUN ] Unix/UrlPathTest.stringToUrl/absolute_path46 > [ OK ] Unix/UrlPathTest.stringToUrl/absolute_path (0 ms)47 > [ RUN ] Unix/UrlPathTest.stringToUrl/root_path48 > [ OK ] Unix/UrlPathTest.stringToUrl/root_path (0 ms)49 > [----------] 8 tests from Unix/UrlPathTest (0 ms total)50 >51 > [----------] Global test environment tear-down52 > [==========] 833 tests from 159 test suites ran. (1757 ms total)53 > [ PASSED ] 829 tests.54 > [ SKIPPED ] 2 tests, listed below:55 > [ SKIPPED ] CompressionDecompression/CompressionDecompressionTest.invalidDecompression/none56 > [ SKIPPED ] CompressionDecompression/CompressionDecompressionTest.truncatedInputIsRejected/none57 > [ FAILED ] 2 tests, listed below:58 > [ FAILED ] RootDeletePath.restrictiveDirectoryPermissions59 > [ FAILED ] RootDeletePath.modeChangesDenied60 >61 > 2 FAILED TESTS62 > YOU HAVE 1 DISABLED TEST63 >64 For full logs, run:65 nix log /nix/store/3kvzh0spg1vdfv378a36vz5577i9g8w8-nix-util-tests-run.drv66error: Cannot build '/nix/store/5qam262gikv7nl8pmw8dcd6dihm8lza8-nix-2.36.0pre20261018_9d8ebdb5.drv'.67 Reason: 1 dependency failed.68 Output paths:69 /nix/store/flqzid79xphw99kqfc43p2ijgkgkipfm-nix-2.36.0pre20261018_9d8ebdb570 /nix/store/inlsq54327b3x0nmfxyzsk6vam6xgxn8-nix-2.36.0pre20261018_9d8ebdb5-dev71 /nix/store/vizy5520y2hxhd0vh5mp1l73xz03nyyk-nix-2.36.0pre20261018_9d8ebdb5-man72 /nix/store/wjkpsqd46rxpzc8vhpsrl0rncyran7gz-nix-2.36.0pre20261018_9d8ebdb5-doc73error: Cannot build '/nix/store/dqg1lmg4y9nrx9szms3a1rdljgi0s2wr-nix-grpc-store-exit-stress.drv'.74 Reason: 1 dependency failed.75 Output paths:76 /nix/store/xvb9ps0d31s7v9bd4p4n45hjhwfmf2ks-nix-grpc-store-exit-stress