nix-util-tests-run
checks.aarch64-darwin.exit-stress
· build #662
· raw
1tribuchet: building on mac022Note: Google Test filter = -3[==========] Running 833 tests from 159 test suites.4[----------] Global test environment set-up.5[----------] 1 test from openFileEnsureBeneathNoSymlinksDeathTest6[ RUN ] openFileEnsureBeneathNoSymlinksDeathTest.rejectsONofollow7[ OK ] openFileEnsureBeneathNoSymlinksDeathTest.rejectsONofollow (6 ms)8[----------] 1 test from openFileEnsureBeneathNoSymlinksDeathTest (6 ms total)910[----------] 2 tests from alignUp11[ RUN ] alignUp.value12[ OK ] alignUp.value (0 ms)13[ RUN ] alignUp.notAPowerOf214[ OK ] alignUp.notAPowerOf2 (1 ms)15[----------] 2 tests from alignUp (1 ms total)1617[----------] 3 tests from alignUpOverflowTest/0, where TypeParam = unsigned char18[ RUN ] alignUpOverflowTest/0.lastSafeValue19[ OK ] alignUpOverflowTest/0.lastSafeValue (0 ms)20[ RUN ] alignUpOverflowTest/0.overflowThrows21[ OK ] alignUpOverflowTest/0.overflowThrows (0 ms)22[ RUN ] alignUpOverflowTest/0.alignmentOneNeverOverflows23[ OK ] alignUpOverflowTest/0.alignmentOneNeverOverflows (0 ms)24[----------] 3 tests from alignUpOverflowTest/0 (0 ms total)2526[----------] 3 tests from alignUpOverflowTest/1, where TypeParam = unsigned short27[ RUN ] alignUpOverflowTest/1.lastSafeValue28[ OK ] alignUpOverflowTest/1.lastSafeValue (0 ms)29[ RUN ] alignUpOverflowTest/1.overflowThrows30[ OK ] alignUpOverflowTest/1.overflowThrows (0 ms)31[ RUN ] alignUpOverflowTest/1.alignmentOneNeverOverflows32[ OK ] alignUpOverflowTest/1.alignmentOneNeverOverflows (0 ms)33[----------] 3 tests from alignUpOverflowTest/1 (0 ms total)3435[----------] 3 tests from alignUpOverflowTest/2, where TypeParam = unsigned int36[ RUN ] alignUpOverflowTest/2.lastSafeValue37[ OK ] alignUpOverflowTest/2.lastSafeValue (0 ms)38[ RUN ] alignUpOverflowTest/2.overflowThrows39[ OK ] alignUpOverflowTest/2.overflowThrows (0 ms)40[ RUN ] alignUpOverflowTest/2.alignmentOneNeverOverflows41[ OK ] alignUpOverflowTest/2.alignmentOneNeverOverflows (0 ms)42[----------] 3 tests from alignUpOverflowTest/2 (0 ms total)4344[----------] 3 tests from alignUpOverflowTest/3, where TypeParam = unsigned long long45[ RUN ] alignUpOverflowTest/3.lastSafeValue46[ OK ] alignUpOverflowTest/3.lastSafeValue (0 ms)47[ RUN ] alignUpOverflowTest/3.overflowThrows48[ OK ] alignUpOverflowTest/3.overflowThrows (0 ms)49[ RUN ] alignUpOverflowTest/3.alignmentOneNeverOverflows50[ OK ] alignUpOverflowTest/3.alignmentOneNeverOverflows (0 ms)51[----------] 3 tests from alignUpOverflowTest/3 (0 ms total)5253[----------] 5 tests from NarTest54[ RUN ] NarTest.oneByteRegularFileParsesWithBothContentModes55[ OK ] NarTest.oneByteRegularFileParsesWithBothContentModes (0 ms)56[ RUN ] NarTest.nonZeroContentPaddingFailsWithBothContentModes57[ OK ] NarTest.nonZeroContentPaddingFailsWithBothContentModes (0 ms)58[ RUN ] NarTest.truncatedLargeContentsFailsWithBothContentModes59[ OK ] NarTest.truncatedLargeContentsFailsWithBothContentModes (0 ms)60[ RUN ] NarTest.truncatedContentPaddingFailsWithBothContentModes61[ OK ] NarTest.truncatedContentPaddingFailsWithBothContentModes (0 ms)62[ RUN ] NarTest.trailingBytesRemainUnreadWithBothContentModes63[ OK ] NarTest.trailingBytesRemainUnreadWithBothContentModes (0 ms)64[----------] 5 tests from NarTest (0 ms total)6566[----------] 14 tests from parseShebangContent67[ RUN ] parseShebangContent.basic68[ OK ] parseShebangContent.basic (0 ms)69[ RUN ] parseShebangContent.empty70[ OK ] parseShebangContent.empty (0 ms)71[ RUN ] parseShebangContent.doubleBacktick72[ OK ] parseShebangContent.doubleBacktick (0 ms)73[ RUN ] parseShebangContent.doubleBacktickEmpty74[ OK ] parseShebangContent.doubleBacktickEmpty (0 ms)75[ RUN ] parseShebangContent.doubleBacktickMarkdownInlineCode76[ OK ] parseShebangContent.doubleBacktickMarkdownInlineCode (0 ms)77[ RUN ] parseShebangContent.doubleBacktickMarkdownCodeBlockNaive78[ OK ] parseShebangContent.doubleBacktickMarkdownCodeBlockNaive (0 ms)79[ RUN ] parseShebangContent.doubleBacktickMarkdownCodeBlockCorrect80[ OK ] parseShebangContent.doubleBacktickMarkdownCodeBlockCorrect (0 ms)81[ RUN ] parseShebangContent.doubleBacktickMarkdownCodeBlock282[ OK ] parseShebangContent.doubleBacktickMarkdownCodeBlock2 (0 ms)83[ RUN ] parseShebangContent.singleBacktickInDoubleBacktickQuotes84[ OK ] parseShebangContent.singleBacktickInDoubleBacktickQuotes (0 ms)85[ RUN ] parseShebangContent.singleBacktickAndSpaceInDoubleBacktickQuotes86[ OK ] parseShebangContent.singleBacktickAndSpaceInDoubleBacktickQuotes (0 ms)87[ RUN ] parseShebangContent.doubleBacktickInDoubleBacktickQuotes88[ OK ] parseShebangContent.doubleBacktickInDoubleBacktickQuotes (0 ms)89[ RUN ] parseShebangContent.increasingQuotes90[ OK ] parseShebangContent.increasingQuotes (0 ms)91[ RUN ] parseShebangContent.prop_round_trip_single92Using configuration: seed=1818032989940216961993[ OK ] parseShebangContent.prop_round_trip_single (0 ms)94[ RUN ] parseShebangContent.prop_round_trip_two95[ OK ] parseShebangContent.prop_round_trip_two (0 ms)96[----------] 14 tests from parseShebangContent (1 ms total)9798[----------] 4 tests from base64Encode99[ RUN ] base64Encode.emptyString100[ OK ] base64Encode.emptyString (0 ms)101[ RUN ] base64Encode.encodesAString102[ OK ] base64Encode.encodesAString (0 ms)103[ RUN ] base64Encode.encodeAndDecode104[ OK ] base64Encode.encodeAndDecode (0 ms)105[ RUN ] base64Encode.encodeAndDecodeNonPrintable106[ OK ] base64Encode.encodeAndDecodeNonPrintable (0 ms)107[----------] 4 tests from base64Encode (0 ms total)108109[----------] 3 tests from base64Decode110[ RUN ] base64Decode.emptyString111[ OK ] base64Decode.emptyString (0 ms)112[ RUN ] base64Decode.decodeAString113[ OK ] base64Decode.decodeAString (0 ms)114[ RUN ] base64Decode.decodeThrowsOnInvalidChar115[ OK ] base64Decode.decodeThrowsOnInvalidChar (0 ms)116[----------] 3 tests from base64Decode (0 ms total)117118[----------] 1 test from BumpMemoryResource119[ RUN ] BumpMemoryResource.ConcurrentAllocation120[ OK ] BumpMemoryResource.ConcurrentAllocation (1 ms)121[----------] 1 test from BumpMemoryResource (1 ms total)122123[----------] 12 tests from CanonPath124[ RUN ] CanonPath.basic125[ OK ] CanonPath.basic (0 ms)126[ RUN ] CanonPath.nullBytes127[ OK ] CanonPath.nullBytes (0 ms)128[ RUN ] CanonPath.fromFilename129[ OK ] CanonPath.fromFilename (0 ms)130[ RUN ] CanonPath.from_existing131[ OK ] CanonPath.from_existing (0 ms)132[ RUN ] CanonPath.pop133[ OK ] CanonPath.pop (0 ms)134[ RUN ] CanonPath.removePrefix135[ OK ] CanonPath.removePrefix (0 ms)136[ RUN ] CanonPath.iter137[ OK ] CanonPath.iter (0 ms)138[ RUN ] CanonPath.concat139[ OK ] CanonPath.concat (0 ms)140[ RUN ] CanonPath.within141[ OK ] CanonPath.within (0 ms)142[ RUN ] CanonPath.sort143[ OK ] CanonPath.sort (0 ms)144[ RUN ] CanonPath.allowed145[ OK ] CanonPath.allowed (0 ms)146[ RUN ] CanonPath.makeRelative147[ OK ] CanonPath.makeRelative (0 ms)148[----------] 12 tests from CanonPath (0 ms total)149150[----------] 9 tests from Checked151[ RUN ] Checked.add_unsigned152[ OK ] Checked.add_unsigned (5 ms)153[ RUN ] Checked.add_signed154[ OK ] Checked.add_signed (5 ms)155[ RUN ] Checked.sub_unsigned156[ OK ] Checked.sub_unsigned (5 ms)157[ RUN ] Checked.sub_signed158[ OK ] Checked.sub_signed (8 ms)159[ RUN ] Checked.mul_unsigned160[ OK ] Checked.mul_unsigned (5 ms)161[ RUN ] Checked.mul_signed162[ OK ] Checked.mul_signed (5 ms)163[ RUN ] Checked.div_unsigned164[ OK ] Checked.div_unsigned (7 ms)165[ RUN ] Checked.div_signed166[ OK ] Checked.div_signed (10 ms)167[ RUN ] Checked.div_signed_special_cases168[ OK ] Checked.div_signed_special_cases (0 ms)169[----------] 9 tests from Checked (53 ms total)170171[----------] 6 tests from ChunkedVector172[ RUN ] ChunkedVector.InitEmpty173[ OK ] ChunkedVector.InitEmpty (0 ms)174[ RUN ] ChunkedVector.GrowsCorrectly175[ OK ] ChunkedVector.GrowsCorrectly (0 ms)176[ RUN ] ChunkedVector.AddAndGet177[ OK ] ChunkedVector.AddAndGet (0 ms)178[ RUN ] ChunkedVector.ForEach179[ OK ] ChunkedVector.ForEach (0 ms)180[ RUN ] ChunkedVector.NonTrivialType181[ OK ] ChunkedVector.NonTrivialType (0 ms)182[ RUN ] ChunkedVector.ConcurrentAdd183[ OK ] ChunkedVector.ConcurrentAdd (8 ms)184[----------] 6 tests from ChunkedVector (8 ms total)185186[----------] 2 tests from closure187[ RUN ] closure.correctClosure188[ OK ] closure.correctClosure (0 ms)189[ RUN ] closure.properlyHandlesDirectExceptions190[ OK ] closure.properlyHandlesDirectExceptions (0 ms)191[----------] 2 tests from closure (0 ms total)192193[----------] 2 tests from compress194[ RUN ] compress.noneMethodDoesNothingToTheInput195[ OK ] compress.noneMethodDoesNothingToTheInput (0 ms)196[ RUN ] compress.zstdExactFrameBoundary197[ OK ] compress.zstdExactFrameBoundary (13 ms)198[----------] 2 tests from compress (13 ms total)199200[----------] 4 tests from decompress201[ RUN ] decompress.brotliWaitsForInputUntilFinish202[ OK ] decompress.brotliWaitsForInputUntilFinish (0 ms)203[ RUN ] decompress.decompressNoneCompressed204[ OK ] decompress.decompressNoneCompressed (0 ms)205[ RUN ] decompress.decompressZstdCompressedParallel206[ OK ] decompress.decompressZstdCompressedParallel (0 ms)207[ RUN ] decompress.decompressZstdMultiFrameLargeInput208[ OK ] decompress.decompressZstdMultiFrameLargeInput (14 ms)209[----------] 4 tests from decompress (14 ms total)210211[----------] 1 test from makeCompressionSink212[ RUN ] makeCompressionSink.noneSinkDoesNothingToInput213[ OK ] makeCompressionSink.noneSinkDoesNothingToInput (0 ms)214[----------] 1 test from makeCompressionSink (0 ms total)215216[----------] 22 tests from Config217[ RUN ] Config.setUndefinedSetting218[ OK ] Config.setUndefinedSetting (0 ms)219[ RUN ] Config.setDefinedSetting220[ OK ] Config.setDefinedSetting (0 ms)221[ RUN ] Config.getDefinedSetting222[ OK ] Config.getDefinedSetting (0 ms)223[ RUN ] Config.getDefinedOverriddenSettingNotSet224[ OK ] Config.getDefinedOverriddenSettingNotSet (0 ms)225[ RUN ] Config.getDefinedSettingSet1226[ OK ] Config.getDefinedSettingSet1 (0 ms)227[ RUN ] Config.getDefinedSettingSet2228[ OK ] Config.getDefinedSettingSet2 (0 ms)229[ RUN ] Config.addSetting230[ OK ] Config.addSetting (0 ms)231[ RUN ] Config.withInitialValue232[ OK ] Config.withInitialValue (0 ms)233[ RUN ] Config.resetOverridden234[ OK ] Config.resetOverridden (0 ms)235[ RUN ] Config.resetOverriddenWithSetting236[ OK ] Config.resetOverriddenWithSetting (0 ms)237[ RUN ] Config.toJSONOnEmptyConfig238[ OK ] Config.toJSONOnEmptyConfig (0 ms)239[ RUN ] Config.toJSONOnNonEmptyConfig240[ OK ] Config.toJSONOnNonEmptyConfig (0 ms)241[ RUN ] Config.toJSONOnNonEmptyConfigWithExperimentalSetting242[ OK ] Config.toJSONOnNonEmptyConfigWithExperimentalSetting (0 ms)243[ RUN ] Config.setSettingAlias244[ OK ] Config.setSettingAlias (0 ms)245[ DISABLED ] Config.DISABLED_reapplyUnknownSettings246[ RUN ] Config.applyConfigEmpty247[ OK ] Config.applyConfigEmpty (0 ms)248[ RUN ] Config.applyConfigEmptyWithComment249[ OK ] Config.applyConfigEmptyWithComment (0 ms)250[ RUN ] Config.applyConfigAssignment251[ OK ] Config.applyConfigAssignment (0 ms)252[ RUN ] Config.applyConfigWithReassignedSetting253[ OK ] Config.applyConfigWithReassignedSetting (0 ms)254[ RUN ] Config.applyConfigFailsOnMissingIncludes255[ OK ] Config.applyConfigFailsOnMissingIncludes (0 ms)256[ RUN ] Config.applyConfigInvalidThrows257[ OK ] Config.applyConfigInvalidThrows (0 ms)258[ RUN ] Config.toKeyValue259[ OK ] Config.toKeyValue (0 ms)260[ RUN ] Config.toKeyValueOmitsDeprecatedSettings261[ OK ] Config.toKeyValueOmitsDeprecatedSettings (0 ms)262[----------] 22 tests from Config (0 ms total)263264[----------] 1 test from getSelfExe265[ RUN ] getSelfExe.works266[ OK ] getSelfExe.works (0 ms)267[----------] 1 test from getSelfExe (0 ms total)268269[----------] 1 test from setEnv270[ RUN ] setEnv.returnsZeroOnSuccess271[ OK ] setEnv.returnsZeroOnSuccess (0 ms)272[----------] 1 test from setEnv (0 ms total)273274[----------] 1 test from setEnvOs275[ RUN ] setEnvOs.returnsZeroOnSuccess276[ OK ] setEnvOs.returnsZeroOnSuccess (0 ms)277[----------] 1 test from setEnvOs (0 ms total)278279[----------] 2 tests from getEnvOs280[ RUN ] getEnvOs.emptyValueIsPresent281[ OK ] getEnvOs.emptyValueIsPresent (0 ms)282[ RUN ] getEnvOs.absentIsNullopt283[ OK ] getEnvOs.absentIsNullopt (0 ms)284[----------] 2 tests from getEnvOs (0 ms total)285286[----------] 1 test from getEnvOsNonEmpty287[ RUN ] getEnvOsNonEmpty.emptyAndAbsentBothNullopt288[ OK ] getEnvOsNonEmpty.emptyAndAbsentBothNullopt (0 ms)289[----------] 1 test from getEnvOsNonEmpty (0 ms total)290291[----------] 1 test from getEnv292[ RUN ] getEnv.agreesWithGetEnvOs293[ OK ] getEnv.agreesWithGetEnvOs (0 ms)294[----------] 1 test from getEnv (0 ms total)295296[----------] 5 tests from ExecutablePath297[ RUN ] ExecutablePath.emptyRoundTrip298[ OK ] ExecutablePath.emptyRoundTrip (0 ms)299[ RUN ] ExecutablePath.oneElemRoundTrip300[ OK ] ExecutablePath.oneElemRoundTrip (0 ms)301[ RUN ] ExecutablePath.twoElemsRoundTrip302[ OK ] ExecutablePath.twoElemsRoundTrip (0 ms)303[ RUN ] ExecutablePath.threeElemsRoundTrip304[ OK ] ExecutablePath.threeElemsRoundTrip (0 ms)305[ RUN ] ExecutablePath.emptyElemNormalize306[ OK ] ExecutablePath.emptyElemNormalize (0 ms)307[----------] 5 tests from ExecutablePath (0 ms total)308309[----------] 3 tests from FileSerialisationMethod310[ RUN ] FileSerialisationMethod.testRoundTripPrintParse_1311[ OK ] FileSerialisationMethod.testRoundTripPrintParse_1 (0 ms)312[ RUN ] FileSerialisationMethod.testRoundTripPrintParse_2313[ OK ] FileSerialisationMethod.testRoundTripPrintParse_2 (0 ms)314[ RUN ] FileSerialisationMethod.testParseFileSerialisationMethodOptException315[ OK ] FileSerialisationMethod.testParseFileSerialisationMethodOptException (0 ms)316[----------] 3 tests from FileSerialisationMethod (0 ms total)317318[----------] 3 tests from FileIngestionMethod319[ RUN ] FileIngestionMethod.testRoundTripPrintParse_1320[ OK ] FileIngestionMethod.testRoundTripPrintParse_1 (0 ms)321[ RUN ] FileIngestionMethod.testRoundTripPrintParse_2322[ OK ] FileIngestionMethod.testRoundTripPrintParse_2 (0 ms)323[ RUN ] FileIngestionMethod.testParseFileIngestionMethodOptException324[ OK ] FileIngestionMethod.testParseFileIngestionMethodOptException (0 ms)325[----------] 3 tests from FileIngestionMethod (0 ms total)326327[----------] 7 tests from ReadLine328[ RUN ] ReadLine.ReadsLinesFromPipe329[ OK ] ReadLine.ReadsLinesFromPipe (0 ms)330[ RUN ] ReadLine.ReturnsPartialLineOnEofWhenAllowed331[ OK ] ReadLine.ReturnsPartialLineOnEofWhenAllowed (0 ms)332[ RUN ] ReadLine.ThrowsOnEofWhenNotAllowed333[ OK ] ReadLine.ThrowsOnEofWhenNotAllowed (0 ms)334[ RUN ] ReadLine.EmptyLine335[ OK ] ReadLine.EmptyLine (0 ms)336[ RUN ] ReadLine.ConsecutiveEmptyLines337[ OK ] ReadLine.ConsecutiveEmptyLines (0 ms)338[ RUN ] ReadLine.LineWithNullBytes339[ OK ] ReadLine.LineWithNullBytes (0 ms)340[ RUN ] ReadLine.TreatsEioAsEof341[ OK ] ReadLine.TreatsEioAsEof (0 ms)342[----------] 7 tests from ReadLine (0 ms total)343344[----------] 10 tests from BufferedSourceReadLine345[ RUN ] BufferedSourceReadLine.ReadsLinesFromPipe346[ OK ] BufferedSourceReadLine.ReadsLinesFromPipe (0 ms)347[ RUN ] BufferedSourceReadLine.ReturnsPartialLineOnEofWhenAllowed348[ OK ] BufferedSourceReadLine.ReturnsPartialLineOnEofWhenAllowed (0 ms)349[ RUN ] BufferedSourceReadLine.ThrowsOnEofWhenNotAllowed350[ OK ] BufferedSourceReadLine.ThrowsOnEofWhenNotAllowed (0 ms)351[ RUN ] BufferedSourceReadLine.EmptyLine352[ OK ] BufferedSourceReadLine.EmptyLine (0 ms)353[ RUN ] BufferedSourceReadLine.ConsecutiveEmptyLines354[ OK ] BufferedSourceReadLine.ConsecutiveEmptyLines (0 ms)355[ RUN ] BufferedSourceReadLine.LineWithNullBytes356[ OK ] BufferedSourceReadLine.LineWithNullBytes (0 ms)357[ RUN ] BufferedSourceReadLine.NewlineAtBufferBoundary358[ OK ] BufferedSourceReadLine.NewlineAtBufferBoundary (0 ms)359[ RUN ] BufferedSourceReadLine.DataRemainsAfterReadLine360[ OK ] BufferedSourceReadLine.DataRemainsAfterReadLine (0 ms)361[ RUN ] BufferedSourceReadLine.LineSpansMultipleRefills362[ OK ] BufferedSourceReadLine.LineSpansMultipleRefills (0 ms)363[ RUN ] BufferedSourceReadLine.BufferExhaustedThenEof364[ OK ] BufferedSourceReadLine.BufferExhaustedThenEof (0 ms)365[----------] 10 tests from BufferedSourceReadLine (0 ms total)366367[----------] 1 test from WriteFull368[ RUN ] WriteFull.RespectsAllowInterrupts369[ OK ] WriteFull.RespectsAllowInterrupts (0 ms)370[----------] 1 test from WriteFull (0 ms total)371372[----------] 1 test from readLinkAt373[ RUN ] readLinkAt.works374[ OK ] readLinkAt.works (1 ms)375[----------] 1 test from readLinkAt (2 ms total)376377[----------] 1 test from openFileEnsureBeneathNoSymlinks378[ RUN ] openFileEnsureBeneathNoSymlinks.works379[ OK ] openFileEnsureBeneathNoSymlinks.works (2 ms)380[----------] 1 test from openFileEnsureBeneathNoSymlinks (2 ms total)381382[----------] 5 tests from absPath383[ RUN ] absPath.doesntChangeRoot384[ OK ] absPath.doesntChangeRoot (0 ms)385[ RUN ] absPath.turnsEmptyPathIntoCWD386[ OK ] absPath.turnsEmptyPathIntoCWD (0 ms)387[ RUN ] absPath.usesOptionalBasePathWhenGiven388[ OK ] absPath.usesOptionalBasePathWhenGiven (0 ms)389[ RUN ] absPath.isIdempotent390[ OK ] absPath.isIdempotent (0 ms)391[ RUN ] absPath.pathIsCanonicalised392[ OK ] absPath.pathIsCanonicalised (0 ms)393[----------] 5 tests from absPath (0 ms total)394395[----------] 4 tests from canonPath396[ RUN ] canonPath.removesTrailingSlashes397[ OK ] canonPath.removesTrailingSlashes (0 ms)398[ RUN ] canonPath.removesDots399[ OK ] canonPath.removesDots (0 ms)400[ RUN ] canonPath.removesDots2401[ OK ] canonPath.removesDots2 (0 ms)402[ RUN ] canonPath.requiresAbsolutePath403[ OK ] canonPath.requiresAbsolutePath (0 ms)404[----------] 4 tests from canonPath (0 ms total)405406[----------] 7 tests from baseNameOf407[ RUN ] baseNameOf.emptyPath408[ OK ] baseNameOf.emptyPath (0 ms)409[ RUN ] baseNameOf.pathOnRoot410[ OK ] baseNameOf.pathOnRoot (0 ms)411[ RUN ] baseNameOf.relativePath412[ OK ] baseNameOf.relativePath (0 ms)413[ RUN ] baseNameOf.pathWithTrailingSlashRoot414[ OK ] baseNameOf.pathWithTrailingSlashRoot (0 ms)415[ RUN ] baseNameOf.trailingSlash416[ OK ] baseNameOf.trailingSlash (0 ms)417[ RUN ] baseNameOf.trailingSlashes418[ OK ] baseNameOf.trailingSlashes (0 ms)419[ RUN ] baseNameOf.absoluteNothingSlashNothing420[ OK ] baseNameOf.absoluteNothingSlashNothing (0 ms)421[----------] 7 tests from baseNameOf (0 ms total)422423[----------] 8 tests from isInDir424[ RUN ] isInDir.trivialCase425[ OK ] isInDir.trivialCase (0 ms)426[ RUN ] isInDir.notInDir427[ OK ] isInDir.notInDir (0 ms)428[ RUN ] isInDir.emptyDir429[ OK ] isInDir.emptyDir (0 ms)430[ RUN ] isInDir.hiddenSubdirectory431[ OK ] isInDir.hiddenSubdirectory (0 ms)432[ RUN ] isInDir.ellipsisEntry433[ OK ] isInDir.ellipsisEntry (0 ms)434[ RUN ] isInDir.sameDir435[ OK ] isInDir.sameDir (0 ms)436[ RUN ] isInDir.sameDirDot437[ OK ] isInDir.sameDirDot (0 ms)438[ RUN ] isInDir.dotDotPrefix439[ OK ] isInDir.dotDotPrefix (0 ms)440[----------] 8 tests from isInDir (0 ms total)441442[----------] 5 tests from isDirOrInDir443[ RUN ] isDirOrInDir.trueForSameDirectory444[ OK ] isDirOrInDir.trueForSameDirectory (0 ms)445[ RUN ] isDirOrInDir.trueForEmptyPaths446[ OK ] isDirOrInDir.trueForEmptyPaths (0 ms)447[ RUN ] isDirOrInDir.falseForDisjunctPaths448[ OK ] isDirOrInDir.falseForDisjunctPaths (0 ms)449[ RUN ] isDirOrInDir.relativePaths450[ OK ] isDirOrInDir.relativePaths (0 ms)451[ RUN ] isDirOrInDir.relativePathsTwice452[ OK ] isDirOrInDir.relativePathsTwice (0 ms)453[----------] 5 tests from isDirOrInDir (0 ms total)454455[----------] 3 tests from pathExists456[ RUN ] pathExists.rootExists457[ OK ] pathExists.rootExists (0 ms)458[ RUN ] pathExists.cwdExists459[ OK ] pathExists.cwdExists (0 ms)460[ RUN ] pathExists.bogusPathDoesNotExist461[ OK ] pathExists.bogusPathDoesNotExist (0 ms)462[----------] 3 tests from pathExists (0 ms total)463464[----------] 2 tests from chmodIfNeeded465[ RUN ] chmodIfNeeded.works466[ OK ] chmodIfNeeded.works (0 ms)467[ RUN ] chmodIfNeeded.nonexistent468[ OK ] chmodIfNeeded.nonexistent (0 ms)469[----------] 2 tests from chmodIfNeeded (0 ms total)470471[----------] 2 tests from DirectoryIterator472[ RUN ] DirectoryIterator.works473[ OK ] DirectoryIterator.works (0 ms)474[ RUN ] DirectoryIterator.nonexistent475[ OK ] DirectoryIterator.nonexistent (0 ms)476[----------] 2 tests from DirectoryIterator (0 ms total)477478[----------] 1 test from createAnonymousTempFile479[ RUN ] createAnonymousTempFile.works480[ OK ] createAnonymousTempFile.works (0 ms)481[----------] 1 test from createAnonymousTempFile (0 ms total)482483[----------] 1 test from FdSource484[ RUN ] FdSource.restartWorks485[ OK ] FdSource.restartWorks (0 ms)486[----------] 1 test from FdSource (0 ms total)487488[----------] 1 test from createTempDir489[ RUN ] createTempDir.works490[ OK ] createTempDir.works (0 ms)491[----------] 1 test from createTempDir (0 ms total)492493[----------] 4 tests from MovePathTest494[ RUN ] MovePathTest.works495[ OK ] MovePathTest.works (0 ms)496[ RUN ] MovePathTest.nonWritableDirectories497[ OK ] MovePathTest.nonWritableDirectories (0 ms)498[ RUN ] MovePathTest.symlinkReplacesSymlink499[ OK ] MovePathTest.symlinkReplacesSymlink (0 ms)500[ RUN ] MovePathTest.symlinkReplacesRegular501[ OK ] MovePathTest.symlinkReplacesRegular (0 ms)502[----------] 4 tests from MovePathTest (1 ms total)503504[----------] 19 tests from fun505[ RUN ] fun.constructFromLambda506[ OK ] fun.constructFromLambda (0 ms)507[ RUN ] fun.constructFromFunctionPointer508[ OK ] fun.constructFromFunctionPointer (0 ms)509[ RUN ] fun.constructFromStdFunction510[ OK ] fun.constructFromStdFunction (0 ms)511[ RUN ] fun.moveConstructFromStdFunction512[ OK ] fun.moveConstructFromStdFunction (0 ms)513[ RUN ] fun.rejectsEmptyStdFunction514[ OK ] fun.rejectsEmptyStdFunction (0 ms)515[ RUN ] fun.rejectsEmptyStdFunctionMove516[ OK ] fun.rejectsEmptyStdFunctionMove (0 ms)517[ RUN ] fun.rejectsNullFunctionPointer518[ OK ] fun.rejectsNullFunctionPointer (0 ms)519[ RUN ] fun.nullptrDeletedAtCompileTime520[ OK ] fun.nullptrDeletedAtCompileTime (0 ms)521[ RUN ] fun.notDefaultConstructible522[ OK ] fun.notDefaultConstructible (0 ms)523[ RUN ] fun.voidReturn524[ OK ] fun.voidReturn (0 ms)525[ RUN ] fun.referenceArgs526[ OK ] fun.referenceArgs (0 ms)527[ RUN ] fun.convertsToStdFunction528[ OK ] fun.convertsToStdFunction (0 ms)529[ RUN ] fun.copyable530[ OK ] fun.copyable (0 ms)531[ RUN ] fun.movable532[ OK ] fun.movable (0 ms)533[ RUN ] fun.capturesState534[ OK ] fun.capturesState (0 ms)535[ RUN ] fun.getFn536[ OK ] fun.getFn (0 ms)537[ RUN ] fun.getFnMove538[ OK ] fun.getFnMove (0 ms)539[ RUN ] fun.forwardsMoveOnlyTypes540[ OK ] fun.forwardsMoveOnlyTypes (0 ms)541[ RUN ] fun.perfectForwardingZeroCost542[ OK ] fun.perfectForwardingZeroCost (0 ms)543[----------] 19 tests from fun (0 ms total)544545[----------] 4 tests from GitMode546[ RUN ] GitMode.gitMode_directory547[ OK ] GitMode.gitMode_directory (0 ms)548[ RUN ] GitMode.gitMode_executable549[ OK ] GitMode.gitMode_executable (0 ms)550[ RUN ] GitMode.gitMode_regular551[ OK ] GitMode.gitMode_regular (0 ms)552[ RUN ] GitMode.gitMode_symlink553[ OK ] GitMode.gitMode_symlink (0 ms)554[----------] 4 tests from GitMode (0 ms total)555556[----------] 8 tests from GitTest557[ RUN ] GitTest.blob_read558[ OK ] GitTest.blob_read (0 ms)559[ RUN ] GitTest.blob_read_large_size560[ OK ] GitTest.blob_read_large_size (0 ms)561[ RUN ] GitTest.blob_write562[ OK ] GitTest.blob_write (0 ms)563[ RUN ] GitTest.tree_sha1_read564[ OK ] GitTest.tree_sha1_read (0 ms)565[ RUN ] GitTest.tree_sha256_read566[ OK ] GitTest.tree_sha256_read (0 ms)567[ RUN ] GitTest.tree_sha1_write568[ OK ] GitTest.tree_sha1_write (0 ms)569[ RUN ] GitTest.tree_sha256_write570[ OK ] GitTest.tree_sha256_write (0 ms)571[ RUN ] GitTest.both_roundrip572[ OK ] GitTest.both_roundrip (0 ms)573[----------] 8 tests from GitTest (0 ms total)574575[----------] 3 tests from GitLsRemote576[ RUN ] GitLsRemote.parseSymrefLineWithReference577[ OK ] GitLsRemote.parseSymrefLineWithReference (0 ms)578[ RUN ] GitLsRemote.parseSymrefLineWithNoReference579[ OK ] GitLsRemote.parseSymrefLineWithNoReference (0 ms)580[ RUN ] GitLsRemote.parseObjectRefLine581[ OK ] GitLsRemote.parseObjectRefLine (0 ms)582[----------] 3 tests from GitLsRemote (0 ms total)583584[----------] 3 tests from BLAKE3HashTest585[ RUN ] BLAKE3HashTest.testKnownBLAKE3Hashes1586[ OK ] BLAKE3HashTest.testKnownBLAKE3Hashes1 (0 ms)587[ RUN ] BLAKE3HashTest.testKnownBLAKE3Hashes2588[ OK ] BLAKE3HashTest.testKnownBLAKE3Hashes2 (0 ms)589[ RUN ] BLAKE3HashTest.testKnownBLAKE3Hashes3590[ OK ] BLAKE3HashTest.testKnownBLAKE3Hashes3 (0 ms)591[----------] 3 tests from BLAKE3HashTest (0 ms total)592593[----------] 8 tests from hashString594[ RUN ] hashString.testKnownMD5Hashes1595[ OK ] hashString.testKnownMD5Hashes1 (0 ms)596[ RUN ] hashString.testKnownMD5Hashes2597[ OK ] hashString.testKnownMD5Hashes2 (0 ms)598[ RUN ] hashString.testKnownSHA1Hashes1599[ OK ] hashString.testKnownSHA1Hashes1 (0 ms)600[ RUN ] hashString.testKnownSHA1Hashes2601[ OK ] hashString.testKnownSHA1Hashes2 (0 ms)602[ RUN ] hashString.testKnownSHA256Hashes1603[ OK ] hashString.testKnownSHA256Hashes1 (0 ms)604[ RUN ] hashString.testKnownSHA256Hashes2605[ OK ] hashString.testKnownSHA256Hashes2 (0 ms)606[ RUN ] hashString.testKnownSHA512Hashes1607[ OK ] hashString.testKnownSHA512Hashes1 (0 ms)608[ RUN ] hashString.testKnownSHA512Hashes2609[ OK ] hashString.testKnownSHA512Hashes2 (0 ms)610[----------] 8 tests from hashString (0 ms total)611612[----------] 3 tests from hashParseExplicitFormatUnprefixed613[ RUN ] hashParseExplicitFormatUnprefixed.testKnownSHA256Hashes1_correct614[ OK ] hashParseExplicitFormatUnprefixed.testKnownSHA256Hashes1_correct (0 ms)615[ RUN ] hashParseExplicitFormatUnprefixed.testKnownSHA256Hashes1_wrongAlgo616[ OK ] hashParseExplicitFormatUnprefixed.testKnownSHA256Hashes1_wrongAlgo (0 ms)617[ RUN ] hashParseExplicitFormatUnprefixed.testKnownSHA256Hashes1_wrongBase618[ OK ] hashParseExplicitFormatUnprefixed.testKnownSHA256Hashes1_wrongBase (0 ms)619[----------] 3 tests from hashParseExplicitFormatUnprefixed (0 ms total)620621[----------] 2 tests from hashFormat622[ RUN ] hashFormat.testRoundTripPrintParse623[ OK ] hashFormat.testRoundTripPrintParse (0 ms)624[ RUN ] hashFormat.testParseHashFormatOptException625[ OK ] hashFormat.testParseHashFormatOptException (0 ms)626[----------] 2 tests from hashFormat (0 ms total)627628[----------] 5 tests from hiliteMatches629[ RUN ] hiliteMatches.noHighlight630[ OK ] hiliteMatches.noHighlight (0 ms)631[ RUN ] hiliteMatches.simpleHighlight632[ OK ] hiliteMatches.simpleHighlight (0 ms)633[ RUN ] hiliteMatches.multipleMatches634[ OK ] hiliteMatches.multipleMatches (0 ms)635[ RUN ] hiliteMatches.overlappingMatches636[ OK ] hiliteMatches.overlappingMatches (0 ms)637[ RUN ] hiliteMatches.complexOverlappingMatches638[ OK ] hiliteMatches.complexOverlappingMatches (0 ms)639[----------] 5 tests from hiliteMatches (0 ms total)640641[----------] 3 tests from to_json642[ RUN ] to_json.optionalInt643[ OK ] to_json.optionalInt (0 ms)644[ RUN ] to_json.vectorOfOptionalInts645[ OK ] to_json.vectorOfOptionalInts (0 ms)646[ RUN ] to_json.optionalVectorOfInts647[ OK ] to_json.optionalVectorOfInts (0 ms)648[----------] 3 tests from to_json (0 ms total)649650[----------] 2 tests from from_json651[ RUN ] from_json.optionalInt652[ OK ] from_json.optionalInt (0 ms)653[ RUN ] from_json.vectorOfOptionalInts654[ OK ] from_json.vectorOfOptionalInts (0 ms)655[----------] 2 tests from from_json (0 ms total)656657[----------] 2 tests from valueAt658[ RUN ] valueAt.simpleObject659[ OK ] valueAt.simpleObject (0 ms)660[ RUN ] valueAt.missingKey661[ OK ] valueAt.missingKey (0 ms)662[----------] 2 tests from valueAt (0 ms total)663664[----------] 2 tests from getObject665[ RUN ] getObject.rightAssertions666[ OK ] getObject.rightAssertions (0 ms)667[ RUN ] getObject.wrongAssertions668[ OK ] getObject.wrongAssertions (0 ms)669[----------] 2 tests from getObject (0 ms total)670671[----------] 2 tests from getArray672[ RUN ] getArray.rightAssertions673[ OK ] getArray.rightAssertions (0 ms)674[ RUN ] getArray.wrongAssertions675[ OK ] getArray.wrongAssertions (0 ms)676[----------] 2 tests from getArray (0 ms total)677678[----------] 2 tests from getString679[ RUN ] getString.rightAssertions680[ OK ] getString.rightAssertions (0 ms)681[ RUN ] getString.wrongAssertions682[ OK ] getString.wrongAssertions (0 ms)683[----------] 2 tests from getString (0 ms total)684685[----------] 2 tests from getIntegralNumber686[ RUN ] getIntegralNumber.rightAssertions687[ OK ] getIntegralNumber.rightAssertions (0 ms)688[ RUN ] getIntegralNumber.wrongAssertions689[ OK ] getIntegralNumber.wrongAssertions (0 ms)690[----------] 2 tests from getIntegralNumber (0 ms total)691692[----------] 2 tests from getBoolean693[ RUN ] getBoolean.rightAssertions694[ OK ] getBoolean.rightAssertions (0 ms)695[ RUN ] getBoolean.wrongAssertions696[ OK ] getBoolean.wrongAssertions (0 ms)697[----------] 2 tests from getBoolean (0 ms total)698699[----------] 2 tests from optionalValueAt700[ RUN ] optionalValueAt.existing701[ OK ] optionalValueAt.existing (0 ms)702[ RUN ] optionalValueAt.empty703[ OK ] optionalValueAt.empty (0 ms)704[----------] 2 tests from optionalValueAt (0 ms total)705706[----------] 2 tests from getNullable707[ RUN ] getNullable.null708[ OK ] getNullable.null (0 ms)709[ RUN ] getNullable.empty710[ OK ] getNullable.empty (0 ms)711[----------] 2 tests from getNullable (0 ms total)712713[----------] 2 tests from local_keys714[ RUN ] local_keys.signAndVerify715[ OK ] local_keys.signAndVerify (0 ms)716[ RUN ] local_keys.rfc8032TestVector717[ OK ] local_keys.rfc8032TestVector (0 ms)718[----------] 2 tests from local_keys (0 ms total)719720[----------] 1 test from HintFmt721[ RUN ] HintFmt.hintFmtArgument722[ OK ] HintFmt.hintFmtArgument (0 ms)723[----------] 1 test from HintFmt (0 ms total)724725[----------] 13 tests from LRUCache726[ RUN ] LRUCache.sizeOfEmptyCacheIsZero727[ OK ] LRUCache.sizeOfEmptyCacheIsZero (0 ms)728[ RUN ] LRUCache.sizeOfSingleElementCacheIsOne729[ OK ] LRUCache.sizeOfSingleElementCacheIsOne (0 ms)730[ RUN ] LRUCache.getFromEmptyCache731[ OK ] LRUCache.getFromEmptyCache (0 ms)732[ RUN ] LRUCache.getExistingValue733[ OK ] LRUCache.getExistingValue (0 ms)734[ RUN ] LRUCache.getNonExistingValueFromNonEmptyCache735[ OK ] LRUCache.getNonExistingValueFromNonEmptyCache (0 ms)736[ RUN ] LRUCache.upsertOnZeroCapacityCache737[ OK ] LRUCache.upsertOnZeroCapacityCache (0 ms)738[ RUN ] LRUCache.updateExistingValue739[ OK ] LRUCache.updateExistingValue (0 ms)740[ RUN ] LRUCache.overwriteOldestWhenCapacityIsReached741[ OK ] LRUCache.overwriteOldestWhenCapacityIsReached (0 ms)742[ RUN ] LRUCache.clearEmptyCache743[ OK ] LRUCache.clearEmptyCache (0 ms)744[ RUN ] LRUCache.clearNonEmptyCache745[ OK ] LRUCache.clearNonEmptyCache (0 ms)746[ RUN ] LRUCache.eraseFromEmptyCache747[ OK ] LRUCache.eraseFromEmptyCache (0 ms)748[ RUN ] LRUCache.eraseMissingFromNonEmptyCache749[ OK ] LRUCache.eraseMissingFromNonEmptyCache (0 ms)750[ RUN ] LRUCache.eraseFromNonEmptyCache751[ OK ] LRUCache.eraseFromNonEmptyCache (0 ms)752[----------] 13 tests from LRUCache (0 ms total)753754[----------] 3 tests from memo755[ RUN ] memo.computesOnce756[ OK ] memo.computesOnce (0 ms)757[ RUN ] memo.copiesShareCache758[ OK ] memo.copiesShareCache (0 ms)759[ RUN ] memo.worksWithString760[ OK ] memo.worksWithString (0 ms)761[----------] 3 tests from memo (0 ms total)762763[----------] 18 tests from MemorySourceAccessorTestErrors764[ RUN ] MemorySourceAccessorTestErrors.readFileNotFound765[ OK ] MemorySourceAccessorTestErrors.readFileNotFound (0 ms)766[ RUN ] MemorySourceAccessorTestErrors.readFileNotARegularFile767[ OK ] MemorySourceAccessorTestErrors.readFileNotARegularFile (0 ms)768[ RUN ] MemorySourceAccessorTestErrors.readDirectoryNotFound769[ OK ] MemorySourceAccessorTestErrors.readDirectoryNotFound (0 ms)770[ RUN ] MemorySourceAccessorTestErrors.readDirectoryNotADirectory771[ OK ] MemorySourceAccessorTestErrors.readDirectoryNotADirectory (0 ms)772[ RUN ] MemorySourceAccessorTestErrors.readLinkNotFound773[ OK ] MemorySourceAccessorTestErrors.readLinkNotFound (0 ms)774[ RUN ] MemorySourceAccessorTestErrors.readLinkNotASymlink775[ OK ] MemorySourceAccessorTestErrors.readLinkNotASymlink (0 ms)776[ RUN ] MemorySourceAccessorTestErrors.addFileParentNotDirectory777[ OK ] MemorySourceAccessorTestErrors.addFileParentNotDirectory (0 ms)778[ RUN ] MemorySourceAccessorTestErrors.addFileNotARegularFile779[ OK ] MemorySourceAccessorTestErrors.addFileNotARegularFile (0 ms)780[ RUN ] MemorySourceAccessorTestErrors.createDirectoryParentNotDirectory781[ OK ] MemorySourceAccessorTestErrors.createDirectoryParentNotDirectory (0 ms)782[ RUN ] MemorySourceAccessorTestErrors.createDirectoryNotADirectory783[ OK ] MemorySourceAccessorTestErrors.createDirectoryNotADirectory (0 ms)784[ RUN ] MemorySourceAccessorTestErrors.createRegularFileParentNotDirectory785[ OK ] MemorySourceAccessorTestErrors.createRegularFileParentNotDirectory (0 ms)786[ RUN ] MemorySourceAccessorTestErrors.createRegularFileNotARegularFile787[ OK ] MemorySourceAccessorTestErrors.createRegularFileNotARegularFile (0 ms)788[ RUN ] MemorySourceAccessorTestErrors.createSymlinkParentNotDirectory789[ OK ] MemorySourceAccessorTestErrors.createSymlinkParentNotDirectory (0 ms)790[ RUN ] MemorySourceAccessorTestErrors.createSymlinkNotASymlink791[ OK ] MemorySourceAccessorTestErrors.createSymlinkNotASymlink (0 ms)792[ RUN ] MemorySourceAccessorTestErrors.pathExistsThroughRegularFile793[ OK ] MemorySourceAccessorTestErrors.pathExistsThroughRegularFile (0 ms)794[ RUN ] MemorySourceAccessorTestErrors.maybeLstatThroughRegularFile795[ OK ] MemorySourceAccessorTestErrors.maybeLstatThroughRegularFile (0 ms)796[ RUN ] MemorySourceAccessorTestErrors.pathExistsThroughSymlink797[ OK ] MemorySourceAccessorTestErrors.pathExistsThroughSymlink (0 ms)798[ RUN ] MemorySourceAccessorTestErrors.createFileThroughSymlink799[ OK ] MemorySourceAccessorTestErrors.createFileThroughSymlink (0 ms)800[----------] 18 tests from MemorySourceAccessorTestErrors (0 ms total)801802[----------] 1 test from MonitorFdHup803[ RUN ] MonitorFdHup.shouldNotBlock804[ OK ] MonitorFdHup.shouldNotBlock (0 ms)805[----------] 1 test from MonitorFdHup (0 ms total)806807[----------] 1 test from nix_api_util808[ RUN ] nix_api_util.nix_version_get809[ OK ] nix_api_util.nix_version_get (0 ms)810[----------] 1 test from nix_api_util (0 ms total)811812[----------] 8 tests from nix_api_util_context813[ RUN ] nix_api_util_context.nix_setting_get814[ OK ] nix_api_util_context.nix_setting_get (0 ms)815[ RUN ] nix_api_util_context.nix_setting_set816[ OK ] nix_api_util_context.nix_setting_set (0 ms)817[ RUN ] nix_api_util_context.nix_err_msg818[ OK ] nix_api_util_context.nix_err_msg (0 ms)819[ RUN ] nix_api_util_context.nix_err_code820[ OK ] nix_api_util_context.nix_err_code (0 ms)821[ RUN ] nix_api_util_context.nix_context_error822[ OK ] nix_api_util_context.nix_context_error (0 ms)823[ RUN ] nix_api_util_context.nix_set_err_msg824[ OK ] nix_api_util_context.nix_set_err_msg (0 ms)825[ RUN ] nix_api_util_context.nix_err_info_msg826[ OK ] nix_api_util_context.nix_err_info_msg (0 ms)827[ RUN ] nix_api_util_context.nix_err_name828[ OK ] nix_api_util_context.nix_err_name (0 ms)829[----------] 8 tests from nix_api_util_context (0 ms total)830831[----------] 7 tests from Pool832[ RUN ] Pool.freshPoolHasZeroCountAndSpecifiedCapacity833[ OK ] Pool.freshPoolHasZeroCountAndSpecifiedCapacity (0 ms)834[ RUN ] Pool.freshPoolCanGetAResource835[ OK ] Pool.freshPoolCanGetAResource (0 ms)836[ RUN ] Pool.capacityCanBeIncremented837[ OK ] Pool.capacityCanBeIncremented (0 ms)838[ RUN ] Pool.capacityCanBeDecremented839[ OK ] Pool.capacityCanBeDecremented (0 ms)840[ RUN ] Pool.flushBadDropsOutOfScopeResources841[ OK ] Pool.flushBadDropsOutOfScopeResources (0 ms)842[ RUN ] Pool.reuseResource843[ OK ] Pool.reuseResource (0 ms)844[ RUN ] Pool.badResourceIsNotReused845[ OK ] Pool.badResourceIsNotReused (0 ms)846[----------] 7 tests from Pool (0 ms total)847848[----------] 4 tests from Position849[ RUN ] Position.getSnippetUpTo_0850[ OK ] Position.getSnippetUpTo_0 (0 ms)851[ RUN ] Position.getSnippetUpTo_1852[ OK ] Position.getSnippetUpTo_1 (0 ms)853[ RUN ] Position.getSnippetUpTo_2854[ OK ] Position.getSnippetUpTo_2 (0 ms)855[ RUN ] Position.example_1856[ OK ] Position.example_1 (0 ms)857[----------] 4 tests from Position (0 ms total)858859[----------] 1 test from statusOk860[ RUN ] statusOk.zeroIsOk861[ OK ] statusOk.zeroIsOk (0 ms)862[----------] 1 test from statusOk (0 ms total)863864[----------] 2 tests from runProgram865[ RUN ] runProgram.worksTrivial866[ OK ] runProgram.worksTrivial (35 ms)867[ RUN ] runProgram.nonexistent868error: executing "/this/path/really/should/not/exist/for/real": No such file or directory869[ OK ] runProgram.nonexistent (2 ms)870[----------] 2 tests from runProgram (37 ms total)871872[----------] 3 tests from runProgram2873[ RUN ] runProgram2.mergeStderrToStdout874[ OK ] runProgram2.mergeStderrToStdout (42 ms)875[ RUN ] runProgram2.nonexistent876error: executing "/this/path/really/should/not/exist/for/real": No such file or directory877[ OK ] runProgram2.nonexistent (2 ms)878[ RUN ] runProgram2.leakedFDsAreClosed879[ OK ] runProgram2.leakedFDsAreClosed (20 ms)880[----------] 3 tests from runProgram2 (65 ms total)881882[----------] 6 tests from ref883[ RUN ] ref.upcast_is_implicit884[ OK ] ref.upcast_is_implicit (0 ms)885[ RUN ] ref.downcast_is_rejected886[ OK ] ref.downcast_is_rejected (0 ms)887[ RUN ] ref.same_type_conversion888[ OK ] ref.same_type_conversion (0 ms)889[ RUN ] ref.explicit_downcast_with_cast890[ OK ] ref.explicit_downcast_with_cast (0 ms)891[ RUN ] ref.invalid_cast_throws892[ OK ] ref.invalid_cast_throws (0 ms)893[ RUN ] ref.explicit_downcast_with_dynamic_pointer_cast894[ OK ] ref.explicit_downcast_with_dynamic_pointer_cast (0 ms)895[----------] 6 tests from ref (0 ms total)896897[----------] 1 test from readNum898[ RUN ] readNum.negativeValuesSerialiseWellDefined899[ OK ] readNum.negativeValuesSerialiseWellDefined (0 ms)900[----------] 1 test from readNum (0 ms total)901902[----------] 2 tests from readString903[ RUN ] readString.roundTrip904[ OK ] readString.roundTrip (0 ms)905[ RUN ] readString.bogusLengthDoesNotPreallocate906[ OK ] readString.bogusLengthDoesNotPreallocate (0 ms)907[----------] 2 tests from readString (0 ms total)908909[----------] 2 tests from readError910[ RUN ] readError.bogusLevelIsClamped911[ OK ] readError.bogusLevelIsClamped (0 ms)912[ RUN ] readError.uint64LevelError913[ OK ] readError.uint64LevelError (0 ms)914[----------] 2 tests from readError (0 ms total)915916[----------] 1 test from readPadding917[ RUN ] readPadding.works918[ OK ] readPadding.works (0 ms)919[----------] 1 test from readPadding (0 ms total)920921[----------] 1 test from sourceToSink922[ RUN ] sourceToSink.forcedUnwindUcaughtExceptions923[ OK ] sourceToSink.forcedUnwindUcaughtExceptions (0 ms)924[----------] 1 test from sourceToSink (0 ms total)925926[----------] 2 tests from MonotonicSubranges927[ RUN ] MonotonicSubranges.empty928[ OK ] MonotonicSubranges.empty (0 ms)929[ RUN ] MonotonicSubranges.basic930[ OK ] MonotonicSubranges.basic (0 ms)931[----------] 2 tests from MonotonicSubranges (0 ms total)932933[----------] 2 tests from SortTestPermutations/0, where TypeParam = int934[ RUN ] SortTestPermutations/0.insertionsort935[ OK ] SortTestPermutations/0.insertionsort (0 ms)936[ RUN ] SortTestPermutations/0.peeksort937[ OK ] SortTestPermutations/0.peeksort (0 ms)938[----------] 2 tests from SortTestPermutations/0 (0 ms total)939940[----------] 2 tests from SortTestPermutations/1, where TypeParam = long long941[ RUN ] SortTestPermutations/1.insertionsort942[ OK ] SortTestPermutations/1.insertionsort (0 ms)943[ RUN ] SortTestPermutations/1.peeksort944[ OK ] SortTestPermutations/1.peeksort (0 ms)945[----------] 2 tests from SortTestPermutations/1 (0 ms total)946947[----------] 2 tests from SortTestPermutations/2, where TypeParam = short948[ RUN ] SortTestPermutations/2.insertionsort949[ OK ] SortTestPermutations/2.insertionsort (0 ms)950[ RUN ] SortTestPermutations/2.peeksort951[ OK ] SortTestPermutations/2.peeksort (0 ms)952[----------] 2 tests from SortTestPermutations/2 (0 ms total)953954[----------] 2 tests from SortTestPermutations/3, where TypeParam = unsigned int955[ RUN ] SortTestPermutations/3.insertionsort956[ OK ] SortTestPermutations/3.insertionsort (0 ms)957[ RUN ] SortTestPermutations/3.peeksort958[ OK ] SortTestPermutations/3.peeksort (0 ms)959[----------] 2 tests from SortTestPermutations/3 (0 ms total)960961[----------] 2 tests from SortTestPermutations/4, where TypeParam = unsigned long962[ RUN ] SortTestPermutations/4.insertionsort963[ OK ] SortTestPermutations/4.insertionsort (0 ms)964[ RUN ] SortTestPermutations/4.peeksort965[ OK ] SortTestPermutations/4.peeksort (0 ms)966[----------] 2 tests from SortTestPermutations/4 (0 ms total)967968[----------] 1 test from InsertionSort969[ RUN ] InsertionSort.empty970[ OK ] InsertionSort.empty (0 ms)971[----------] 1 test from InsertionSort (0 ms total)972973[----------] 4 tests from SortProperty/0, where TypeParam = int974[ RUN ] SortProperty/0.peeksortSorted975[ OK ] SortProperty/0.peeksortSorted (0 ms)976[ RUN ] SortProperty/0.peeksortSortedGreater977[ OK ] SortProperty/0.peeksortSortedGreater (0 ms)978[ RUN ] SortProperty/0.insertionsortSorted979[ OK ] SortProperty/0.insertionsortSorted (0 ms)980[ RUN ] SortProperty/0.peeksortSortedLinearComparisonComplexity981[ OK ] SortProperty/0.peeksortSortedLinearComparisonComplexity (0 ms)982[----------] 4 tests from SortProperty/0 (1 ms total)983984[----------] 4 tests from SortProperty/1, where TypeParam = unsigned int985[ RUN ] SortProperty/1.peeksortSorted986[ OK ] SortProperty/1.peeksortSorted (0 ms)987[ RUN ] SortProperty/1.peeksortSortedGreater988[ OK ] SortProperty/1.peeksortSortedGreater (0 ms)989[ RUN ] SortProperty/1.insertionsortSorted990[ OK ] SortProperty/1.insertionsortSorted (0 ms)991[ RUN ] SortProperty/1.peeksortSortedLinearComparisonComplexity992[ OK ] SortProperty/1.peeksortSortedLinearComparisonComplexity (0 ms)993[----------] 4 tests from SortProperty/1 (1 ms total)994995[----------] 4 tests from SortProperty/2, where TypeParam = long long996[ RUN ] SortProperty/2.peeksortSorted997[ OK ] SortProperty/2.peeksortSorted (0 ms)998[ RUN ] SortProperty/2.peeksortSortedGreater999[ OK ] SortProperty/2.peeksortSortedGreater (0 ms)1000[ RUN ] SortProperty/2.insertionsortSorted1001[ OK ] SortProperty/2.insertionsortSorted (0 ms)1002[ RUN ] SortProperty/2.peeksortSortedLinearComparisonComplexity1003[ OK ] SortProperty/2.peeksortSortedLinearComparisonComplexity (0 ms)1004[----------] 4 tests from SortProperty/2 (1 ms total)10051006[----------] 4 tests from SortProperty/3, where TypeParam = short1007[ RUN ] SortProperty/3.peeksortSorted1008[ OK ] SortProperty/3.peeksortSorted (0 ms)1009[ RUN ] SortProperty/3.peeksortSortedGreater1010[ OK ] SortProperty/3.peeksortSortedGreater (0 ms)1011[ RUN ] SortProperty/3.insertionsortSorted1012[ OK ] SortProperty/3.insertionsortSorted (0 ms)1013[ RUN ] SortProperty/3.peeksortSortedLinearComparisonComplexity1014[ OK ] SortProperty/3.peeksortSortedLinearComparisonComplexity (0 ms)1015[----------] 4 tests from SortProperty/3 (1 ms total)10161017[----------] 4 tests from SortProperty/4, where TypeParam = std::basic_string<char,std::__1::char_traits<char>,std::__1::allocator<char>>1018[ RUN ] SortProperty/4.peeksortSorted1019[ OK ] SortProperty/4.peeksortSorted (2 ms)1020[ RUN ] SortProperty/4.peeksortSortedGreater1021[ OK ] SortProperty/4.peeksortSortedGreater (2 ms)1022[ RUN ] SortProperty/4.insertionsortSorted1023[ OK ] SortProperty/4.insertionsortSorted (1 ms)1024[ RUN ] SortProperty/4.peeksortSortedLinearComparisonComplexity1025[ OK ] SortProperty/4.peeksortSortedLinearComparisonComplexity (1 ms)1026[----------] 4 tests from SortProperty/4 (7 ms total)10271028[----------] 1 test from SortProperty1029[ RUN ] SortProperty.peeksortStability1030[ OK ] SortProperty.peeksortStability (0 ms)1031[----------] 1 test from SortProperty (0 ms total)10321033[----------] 4 tests from FSSourceAccessorTest1034[ RUN ] FSSourceAccessorTest.works1035[ OK ] FSSourceAccessorTest.works (1 ms)1036[ RUN ] FSSourceAccessorTest.invalidateCacheDropsStaleDirFds1037[ OK ] FSSourceAccessorTest.invalidateCacheDropsStaleDirFds (0 ms)1038[ RUN ] FSSourceAccessorTest.RestoreSinkRegularFileAtRoot1039[ OK ] FSSourceAccessorTest.RestoreSinkRegularFileAtRoot (0 ms)1040[ RUN ] FSSourceAccessorTest.RestoreSinkSymlinkAtRoot1041[ OK ] FSSourceAccessorTest.RestoreSinkSymlinkAtRoot (0 ms)1042[----------] 4 tests from FSSourceAccessorTest (2 ms total)10431044[----------] 8 tests from concatStringsSep1045[ RUN ] concatStringsSep.empty1046[ OK ] concatStringsSep.empty (0 ms)1047[ RUN ] concatStringsSep.justOne1048[ OK ] concatStringsSep.justOne (0 ms)1049[ RUN ] concatStringsSep.emptyString1050[ OK ] concatStringsSep.emptyString (0 ms)1051[ RUN ] concatStringsSep.emptyStrings1052[ OK ] concatStringsSep.emptyStrings (0 ms)1053[ RUN ] concatStringsSep.threeEmptyStrings1054[ OK ] concatStringsSep.threeEmptyStrings (0 ms)1055[ RUN ] concatStringsSep.buildCommaSeparatedString1056[ OK ] concatStringsSep.buildCommaSeparatedString (0 ms)1057[ RUN ] concatStringsSep.buildStringWithEmptySeparator1058[ OK ] concatStringsSep.buildStringWithEmptySeparator (0 ms)1059[ RUN ] concatStringsSep.buildSingleString1060[ OK ] concatStringsSep.buildSingleString (0 ms)1061[----------] 8 tests from concatStringsSep (0 ms total)10621063[----------] 4 tests from concatMapStringsSep1064[ RUN ] concatMapStringsSep.empty1065[ OK ] concatMapStringsSep.empty (0 ms)1066[ RUN ] concatMapStringsSep.justOne1067[ OK ] concatMapStringsSep.justOne (0 ms)1068[ RUN ] concatMapStringsSep.two1069[ OK ] concatMapStringsSep.two (0 ms)1070[ RUN ] concatMapStringsSep.map1071[ OK ] concatMapStringsSep.map (0 ms)1072[----------] 4 tests from concatMapStringsSep (0 ms total)10731074[----------] 5 tests from dropEmptyInitThenConcatStringsSep1075[ RUN ] dropEmptyInitThenConcatStringsSep.empty1076[ OK ] dropEmptyInitThenConcatStringsSep.empty (0 ms)1077[ RUN ] dropEmptyInitThenConcatStringsSep.buildCommaSeparatedString1078[ OK ] dropEmptyInitThenConcatStringsSep.buildCommaSeparatedString (0 ms)1079[ RUN ] dropEmptyInitThenConcatStringsSep.buildStringWithEmptySeparator1080[ OK ] dropEmptyInitThenConcatStringsSep.buildStringWithEmptySeparator (0 ms)1081[ RUN ] dropEmptyInitThenConcatStringsSep.buildSingleString1082[ OK ] dropEmptyInitThenConcatStringsSep.buildSingleString (0 ms)1083[ RUN ] dropEmptyInitThenConcatStringsSep.emptyStrings1084[ OK ] dropEmptyInitThenConcatStringsSep.emptyStrings (0 ms)1085[----------] 5 tests from dropEmptyInitThenConcatStringsSep (0 ms total)10861087[----------] 12 tests from tokenizeString1088[ RUN ] tokenizeString.empty1089[ OK ] tokenizeString.empty (0 ms)1090[ RUN ] tokenizeString.oneSep1091[ OK ] tokenizeString.oneSep (0 ms)1092[ RUN ] tokenizeString.twoSep1093[ OK ] tokenizeString.twoSep (0 ms)1094[ RUN ] tokenizeString.tokenizeSpacesWithDefaults1095[ OK ] tokenizeString.tokenizeSpacesWithDefaults (0 ms)1096[ RUN ] tokenizeString.tokenizeTabsWithDefaults1097[ OK ] tokenizeString.tokenizeTabsWithDefaults (0 ms)1098[ RUN ] tokenizeString.tokenizeTabsSpacesWithDefaults1099[ OK ] tokenizeString.tokenizeTabsSpacesWithDefaults (0 ms)1100[ RUN ] tokenizeString.tokenizeTabsSpacesNewlineWithDefaults1101[ OK ] tokenizeString.tokenizeTabsSpacesNewlineWithDefaults (0 ms)1102[ RUN ] tokenizeString.tokenizeTabsSpacesNewlineRetWithDefaults1103[ OK ] tokenizeString.tokenizeTabsSpacesNewlineRetWithDefaults (0 ms)1104[ RUN ] tokenizeString.tokenizeWithCustomSep1105[ OK ] tokenizeString.tokenizeWithCustomSep (0 ms)1106[ RUN ] tokenizeString.tokenizeSepAtStart1107[ OK ] tokenizeString.tokenizeSepAtStart (0 ms)1108[ RUN ] tokenizeString.tokenizeSepAtEnd1109[ OK ] tokenizeString.tokenizeSepAtEnd (0 ms)1110[ RUN ] tokenizeString.tokenizeSepEmpty1111[ OK ] tokenizeString.tokenizeSepEmpty (0 ms)1112[----------] 12 tests from tokenizeString (0 ms total)11131114[----------] 13 tests from splitStringTest/0, where TypeParam = std::vector<std::__1::basic_string<char,std::__1::char_traits<char>,std::__1::allocator<char>>,std::__1::allocator<std::__1::basic_string<char,std::__1::char_traits<char>,std::__1::allocator<char>>>>1115[ RUN ] splitStringTest/0.empty1116[ OK ] splitStringTest/0.empty (0 ms)1117[ RUN ] splitStringTest/0.oneSep1118[ OK ] splitStringTest/0.oneSep (0 ms)1119[ RUN ] splitStringTest/0.twoSep1120[ OK ] splitStringTest/0.twoSep (0 ms)1121[ RUN ] splitStringTest/0.tokenizeSpacesWithSpaces1122[ OK ] splitStringTest/0.tokenizeSpacesWithSpaces (0 ms)1123[ RUN ] splitStringTest/0.tokenizeTabsWithDefaults1124[ OK ] splitStringTest/0.tokenizeTabsWithDefaults (0 ms)1125[ RUN ] splitStringTest/0.tokenizeTabsSpacesWithDefaults1126[ OK ] splitStringTest/0.tokenizeTabsSpacesWithDefaults (0 ms)1127[ RUN ] splitStringTest/0.tokenizeTabsSpacesNewlineWithDefaults1128[ OK ] splitStringTest/0.tokenizeTabsSpacesNewlineWithDefaults (0 ms)1129[ RUN ] splitStringTest/0.tokenizeTabsSpacesNewlineRetWithDefaults1130[ OK ] splitStringTest/0.tokenizeTabsSpacesNewlineRetWithDefaults (0 ms)1131[ RUN ] splitStringTest/0.tokenizeWithCustomSep1132[ OK ] splitStringTest/0.tokenizeWithCustomSep (0 ms)1133[ RUN ] splitStringTest/0.tokenizeSepAtStart1134[ OK ] splitStringTest/0.tokenizeSepAtStart (0 ms)1135[ RUN ] splitStringTest/0.tokenizeSepAtEnd1136[ OK ] splitStringTest/0.tokenizeSepAtEnd (0 ms)1137[ RUN ] splitStringTest/0.tokenizeSepEmpty1138[ OK ] splitStringTest/0.tokenizeSepEmpty (0 ms)1139[ RUN ] splitStringTest/0.recoveredByConcatStringsSep1140[ OK ] splitStringTest/0.recoveredByConcatStringsSep (0 ms)1141[----------] 13 tests from splitStringTest/0 (0 ms total)11421143[----------] 13 tests from splitStringTest/1, where TypeParam = std::vector<std::__1::basic_string_view<char,std::__1::char_traits<char>>,std::__1::allocator<std::__1::basic_string_view<char,std::__1::char_traits<char>>>>1144[ RUN ] splitStringTest/1.empty1145[ OK ] splitStringTest/1.empty (0 ms)1146[ RUN ] splitStringTest/1.oneSep1147[ OK ] splitStringTest/1.oneSep (0 ms)1148[ RUN ] splitStringTest/1.twoSep1149[ OK ] splitStringTest/1.twoSep (0 ms)1150[ RUN ] splitStringTest/1.tokenizeSpacesWithSpaces1151[ OK ] splitStringTest/1.tokenizeSpacesWithSpaces (0 ms)1152[ RUN ] splitStringTest/1.tokenizeTabsWithDefaults1153[ OK ] splitStringTest/1.tokenizeTabsWithDefaults (0 ms)1154[ RUN ] splitStringTest/1.tokenizeTabsSpacesWithDefaults1155[ OK ] splitStringTest/1.tokenizeTabsSpacesWithDefaults (0 ms)1156[ RUN ] splitStringTest/1.tokenizeTabsSpacesNewlineWithDefaults1157[ OK ] splitStringTest/1.tokenizeTabsSpacesNewlineWithDefaults (0 ms)1158[ RUN ] splitStringTest/1.tokenizeTabsSpacesNewlineRetWithDefaults1159[ OK ] splitStringTest/1.tokenizeTabsSpacesNewlineRetWithDefaults (0 ms)1160[ RUN ] splitStringTest/1.tokenizeWithCustomSep1161[ OK ] splitStringTest/1.tokenizeWithCustomSep (0 ms)1162[ RUN ] splitStringTest/1.tokenizeSepAtStart1163[ OK ] splitStringTest/1.tokenizeSepAtStart (0 ms)1164[ RUN ] splitStringTest/1.tokenizeSepAtEnd1165[ OK ] splitStringTest/1.tokenizeSepAtEnd (0 ms)1166[ RUN ] splitStringTest/1.tokenizeSepEmpty1167[ OK ] splitStringTest/1.tokenizeSepEmpty (0 ms)1168[ RUN ] splitStringTest/1.recoveredByConcatStringsSep1169[ OK ] splitStringTest/1.recoveredByConcatStringsSep (0 ms)1170[----------] 13 tests from splitStringTest/1 (0 ms total)11711172[----------] 13 tests from splitStringTest/2, where TypeParam = std::list<std::__1::basic_string<char,std::__1::char_traits<char>,std::__1::allocator<char>>,std::__1::allocator<std::__1::basic_string<char,std::__1::char_traits<char>,std::__1::allocator<char>>>>1173[ RUN ] splitStringTest/2.empty1174[ OK ] splitStringTest/2.empty (0 ms)1175[ RUN ] splitStringTest/2.oneSep1176[ OK ] splitStringTest/2.oneSep (0 ms)1177[ RUN ] splitStringTest/2.twoSep1178[ OK ] splitStringTest/2.twoSep (0 ms)1179[ RUN ] splitStringTest/2.tokenizeSpacesWithSpaces1180[ OK ] splitStringTest/2.tokenizeSpacesWithSpaces (0 ms)1181[ RUN ] splitStringTest/2.tokenizeTabsWithDefaults1182[ OK ] splitStringTest/2.tokenizeTabsWithDefaults (0 ms)1183[ RUN ] splitStringTest/2.tokenizeTabsSpacesWithDefaults1184[ OK ] splitStringTest/2.tokenizeTabsSpacesWithDefaults (0 ms)1185[ RUN ] splitStringTest/2.tokenizeTabsSpacesNewlineWithDefaults1186[ OK ] splitStringTest/2.tokenizeTabsSpacesNewlineWithDefaults (0 ms)1187[ RUN ] splitStringTest/2.tokenizeTabsSpacesNewlineRetWithDefaults1188[ OK ] splitStringTest/2.tokenizeTabsSpacesNewlineRetWithDefaults (0 ms)1189[ RUN ] splitStringTest/2.tokenizeWithCustomSep1190[ OK ] splitStringTest/2.tokenizeWithCustomSep (0 ms)1191[ RUN ] splitStringTest/2.tokenizeSepAtStart1192[ OK ] splitStringTest/2.tokenizeSepAtStart (0 ms)1193[ RUN ] splitStringTest/2.tokenizeSepAtEnd1194[ OK ] splitStringTest/2.tokenizeSepAtEnd (0 ms)1195[ RUN ] splitStringTest/2.tokenizeSepEmpty1196[ OK ] splitStringTest/2.tokenizeSepEmpty (0 ms)1197[ RUN ] splitStringTest/2.recoveredByConcatStringsSep1198[ OK ] splitStringTest/2.recoveredByConcatStringsSep (0 ms)1199[----------] 13 tests from splitStringTest/2 (0 ms total)12001201[----------] 13 tests from splitStringTest/3, where TypeParam = std::list<std::__1::basic_string_view<char,std::__1::char_traits<char>>,std::__1::allocator<std::__1::basic_string_view<char,std::__1::char_traits<char>>>>1202[ RUN ] splitStringTest/3.empty1203[ OK ] splitStringTest/3.empty (0 ms)1204[ RUN ] splitStringTest/3.oneSep1205[ OK ] splitStringTest/3.oneSep (0 ms)1206[ RUN ] splitStringTest/3.twoSep1207[ OK ] splitStringTest/3.twoSep (0 ms)1208[ RUN ] splitStringTest/3.tokenizeSpacesWithSpaces1209[ OK ] splitStringTest/3.tokenizeSpacesWithSpaces (0 ms)1210[ RUN ] splitStringTest/3.tokenizeTabsWithDefaults1211[ OK ] splitStringTest/3.tokenizeTabsWithDefaults (0 ms)1212[ RUN ] splitStringTest/3.tokenizeTabsSpacesWithDefaults1213[ OK ] splitStringTest/3.tokenizeTabsSpacesWithDefaults (0 ms)1214[ RUN ] splitStringTest/3.tokenizeTabsSpacesNewlineWithDefaults1215[ OK ] splitStringTest/3.tokenizeTabsSpacesNewlineWithDefaults (0 ms)1216[ RUN ] splitStringTest/3.tokenizeTabsSpacesNewlineRetWithDefaults1217[ OK ] splitStringTest/3.tokenizeTabsSpacesNewlineRetWithDefaults (0 ms)1218[ RUN ] splitStringTest/3.tokenizeWithCustomSep1219[ OK ] splitStringTest/3.tokenizeWithCustomSep (0 ms)1220[ RUN ] splitStringTest/3.tokenizeSepAtStart1221[ OK ] splitStringTest/3.tokenizeSepAtStart (0 ms)1222[ RUN ] splitStringTest/3.tokenizeSepAtEnd1223[ OK ] splitStringTest/3.tokenizeSepAtEnd (0 ms)1224[ RUN ] splitStringTest/3.tokenizeSepEmpty1225[ OK ] splitStringTest/3.tokenizeSepEmpty (0 ms)1226[ RUN ] splitStringTest/3.recoveredByConcatStringsSep1227[ OK ] splitStringTest/3.recoveredByConcatStringsSep (0 ms)1228[----------] 13 tests from splitStringTest/3 (0 ms total)12291230[----------] 14 tests from shellSplitString1231[ RUN ] shellSplitString.empty1232[ OK ] shellSplitString.empty (0 ms)1233[ RUN ] shellSplitString.oneWord1234[ OK ] shellSplitString.oneWord (0 ms)1235[ RUN ] shellSplitString.oneWordQuotedWithSpaces1236[ OK ] shellSplitString.oneWordQuotedWithSpaces (0 ms)1237[ RUN ] shellSplitString.oneWordQuotedWithSpacesAndDoubleQuoteInSingleQuote1238[ OK ] shellSplitString.oneWordQuotedWithSpacesAndDoubleQuoteInSingleQuote (0 ms)1239[ RUN ] shellSplitString.oneWordQuotedWithDoubleQuotes1240[ OK ] shellSplitString.oneWordQuotedWithDoubleQuotes (0 ms)1241[ RUN ] shellSplitString.twoWords1242[ OK ] shellSplitString.twoWords (0 ms)1243[ RUN ] shellSplitString.twoWordsWithSpacesAndQuotesQuoted1244[ OK ] shellSplitString.twoWordsWithSpacesAndQuotesQuoted (0 ms)1245[ RUN ] shellSplitString.emptyArgumentsAreAllowedSingleQuotes1246[ OK ] shellSplitString.emptyArgumentsAreAllowedSingleQuotes (0 ms)1247[ RUN ] shellSplitString.emptyArgumentsAreAllowedDoubleQuotes1248[ OK ] shellSplitString.emptyArgumentsAreAllowedDoubleQuotes (0 ms)1249[ RUN ] shellSplitString.singleQuoteDoesNotUseEscapes1250[ OK ] shellSplitString.singleQuoteDoesNotUseEscapes (0 ms)1251[ RUN ] shellSplitString.doubleQuoteDoesUseEscapes1252[ OK ] shellSplitString.doubleQuoteDoesUseEscapes (0 ms)1253[ RUN ] shellSplitString.backslashEscapesSpaces1254[ OK ] shellSplitString.backslashEscapesSpaces (0 ms)1255[ RUN ] shellSplitString.backslashEscapesQuotes1256[ OK ] shellSplitString.backslashEscapesQuotes (0 ms)1257[ RUN ] shellSplitString.testUnbalancedQuotes1258[ OK ] shellSplitString.testUnbalancedQuotes (0 ms)1259[----------] 14 tests from shellSplitString (0 ms total)12601261[----------] 11 tests from optionalBracket1262[ RUN ] optionalBracket.emptyContent1263[ OK ] optionalBracket.emptyContent (0 ms)1264[ RUN ] optionalBracket.nonEmptyContent1265[ OK ] optionalBracket.nonEmptyContent (0 ms)1266[ RUN ] optionalBracket.emptyPrefixAndSuffix1267[ OK ] optionalBracket.emptyPrefixAndSuffix (0 ms)1268[ RUN ] optionalBracket.emptyContentEmptyBrackets1269[ OK ] optionalBracket.emptyContentEmptyBrackets (0 ms)1270[ RUN ] optionalBracket.complexBrackets1271[ OK ] optionalBracket.complexBrackets (0 ms)1272[ RUN ] optionalBracket.onlyPrefix1273[ OK ] optionalBracket.onlyPrefix (0 ms)1274[ RUN ] optionalBracket.onlySuffix1275[ OK ] optionalBracket.onlySuffix (0 ms)1276[ RUN ] optionalBracket.optionalWithValue1277[ OK ] optionalBracket.optionalWithValue (0 ms)1278[ RUN ] optionalBracket.optionalNullopt1279[ OK ] optionalBracket.optionalNullopt (0 ms)1280[ RUN ] optionalBracket.optionalEmptyString1281[ OK ] optionalBracket.optionalEmptyString (0 ms)1282[ RUN ] optionalBracket.optionalStringViewWithValue1283[ OK ] optionalBracket.optionalStringViewWithValue (0 ms)1284[----------] 11 tests from optionalBracket (0 ms total)12851286[----------] 1 test from Suggestions1287[ RUN ] Suggestions.Trim1288[ OK ] Suggestions.Trim (0 ms)1289[----------] 1 test from Suggestions (0 ms total)12901291[----------] 7 tests from filterANSIEscapes1292[ RUN ] filterANSIEscapes.emptyString1293[ OK ] filterANSIEscapes.emptyString (0 ms)1294[ RUN ] filterANSIEscapes.doesntChangePrintableChars1295[ OK ] filterANSIEscapes.doesntChangePrintableChars (0 ms)1296[ RUN ] filterANSIEscapes.filtersColorCodes1297[ OK ] filterANSIEscapes.filtersColorCodes (0 ms)1298[ RUN ] filterANSIEscapes.expandsTabs1299[ OK ] filterANSIEscapes.expandsTabs (0 ms)1300[ RUN ] filterANSIEscapes.utf81301[ OK ] filterANSIEscapes.utf8 (0 ms)1302[ RUN ] filterANSIEscapes.osc81303[ OK ] filterANSIEscapes.osc8 (0 ms)1304[ RUN ] filterANSIEscapes.osc8_bell_as_sep1305[ OK ] filterANSIEscapes.osc8_bell_as_sep (0 ms)1306[----------] 7 tests from filterANSIEscapes (0 ms total)13071308[----------] 8 tests from FixGitURLTestSuite1309[ RUN ] FixGitURLTestSuite.rejectFileURLWithAuthority1310[ OK ] FixGitURLTestSuite.rejectFileURLWithAuthority (0 ms)1311[ RUN ] FixGitURLTestSuite.rejectRelativePath1312[ OK ] FixGitURLTestSuite.rejectRelativePath (0 ms)1313[ RUN ] FixGitURLTestSuite.rejectEmptyPathGitScp1314[ OK ] FixGitURLTestSuite.rejectEmptyPathGitScp (0 ms)1315[ RUN ] FixGitURLTestSuite.rejectMalformedBracketedURLs1316[ OK ] FixGitURLTestSuite.rejectMalformedBracketedURLs (0 ms)1317[ RUN ] FixGitURLTestSuite.mismatchedBrackets1318[ OK ] FixGitURLTestSuite.mismatchedBrackets (0 ms)1319[ RUN ] FixGitURLTestSuite.slashBeforeColonIsNotScp1320[ OK ] FixGitURLTestSuite.slashBeforeColonIsNotScp (0 ms)1321[ RUN ] FixGitURLTestSuite.noColonIsNotScp1322[ OK ] FixGitURLTestSuite.noColonIsNotScp (0 ms)1323[ RUN ] FixGitURLTestSuite.gitBugDiscardedCharsBetweenBracketAndColon1324[ OK ] FixGitURLTestSuite.gitBugDiscardedCharsBetweenBracketAndColon (0 ms)1325[----------] 8 tests from FixGitURLTestSuite (0 ms total)13261327[----------] 17 tests from parseURL1328[ RUN ] parseURL.parsesSimpleHttpUrlWithComplexFragment1329[ OK ] parseURL.parsesSimpleHttpUrlWithComplexFragment (0 ms)1330[ RUN ] parseURL.rejectsAuthorityInUrlsWithFileTransportation1331[ OK ] parseURL.rejectsAuthorityInUrlsWithFileTransportation (0 ms)1332[ RUN ] parseURL.parseEmptyQueryParams1333warning: dubious URI query '' is missing equal sign '=', ignoring1334warning: dubious URI query '' is missing equal sign '=', ignoring1335warning: dubious URI query '' is missing equal sign '=', ignoring1336warning: dubious URI query '' is missing equal sign '=', ignoring1337warning: dubious URI query '' is missing equal sign '=', ignoring1338warning: dubious URI query '' is missing equal sign '=', ignoring1339[ OK ] parseURL.parseEmptyQueryParams (0 ms)1340[ RUN ] parseURL.parseUserPassword1341[ OK ] parseURL.parseUserPassword (0 ms)1342[ RUN ] parseURL.parseFileURLWithQueryAndFragment1343[ OK ] parseURL.parseFileURLWithQueryAndFragment (0 ms)1344[ RUN ] parseURL.parseFileURL1345[ OK ] parseURL.parseFileURL (0 ms)1346[ RUN ] parseURL.parseFileURLWithAuthority1347[ OK ] parseURL.parseFileURLWithAuthority (0 ms)1348[ RUN ] parseURL.parseFileURLNoLeadingSlash1349[ OK ] parseURL.parseFileURLNoLeadingSlash (0 ms)1350[ RUN ] parseURL.parseHttpTrailingSlash1351[ OK ] parseURL.parseHttpTrailingSlash (0 ms)1352[ RUN ] parseURL.parsedUrlsIsEqualToItself1353[ OK ] parseURL.parsedUrlsIsEqualToItself (0 ms)1354[ RUN ] parseURL.parsedUrlsWithUnescapedChars1355[ OK ] parseURL.parsedUrlsWithUnescapedChars (0 ms)1356[ RUN ] parseURL.parseFTPUrl1357[ OK ] parseURL.parseFTPUrl (0 ms)1358[ RUN ] parseURL.parsesAnythingInUriFormat1359[ OK ] parseURL.parsesAnythingInUriFormat (0 ms)1360[ RUN ] parseURL.parsesAnythingInUriFormatWithoutDoubleSlash1361[ OK ] parseURL.parsesAnythingInUriFormatWithoutDoubleSlash (0 ms)1362[ RUN ] parseURL.emptyStringIsInvalidURL1363[ OK ] parseURL.emptyStringIsInvalidURL (0 ms)1364[ RUN ] parseURL.parsesHttpUrlWithEmptyPort1365[ OK ] parseURL.parsesHttpUrlWithEmptyPort (0 ms)1366[ RUN ] parseURL.gitlabNamespacedProjectUrls1367[ OK ] parseURL.gitlabNamespacedProjectUrls (0 ms)1368[----------] 17 tests from parseURL (0 ms total)13691370[----------] 4 tests from decodeQuery1371[ RUN ] decodeQuery.emptyStringYieldsEmptyMap1372[ OK ] decodeQuery.emptyStringYieldsEmptyMap (0 ms)1373[ RUN ] decodeQuery.simpleDecode1374[ OK ] decodeQuery.simpleDecode (0 ms)1375[ RUN ] decodeQuery.decodeUrlEncodedArgs1376[ OK ] decodeQuery.decodeUrlEncodedArgs (0 ms)1377[ RUN ] decodeQuery.decodeArgWithEmptyValue1378[ OK ] decodeQuery.decodeArgWithEmptyValue (0 ms)1379[----------] 4 tests from decodeQuery (0 ms total)13801381[----------] 4 tests from percentDecode1382[ RUN ] percentDecode.decodesUrlEncodedString1383[ OK ] percentDecode.decodesUrlEncodedString (0 ms)1384[ RUN ] percentDecode.multipleDecodesAreIdempotent1385[ OK ] percentDecode.multipleDecodesAreIdempotent (0 ms)1386[ RUN ] percentDecode.trailingPercent1387[ OK ] percentDecode.trailingPercent (0 ms)1388[ RUN ] percentDecode.incompleteEncoding1389[ OK ] percentDecode.incompleteEncoding (0 ms)1390[----------] 4 tests from percentDecode (0 ms total)13911392[----------] 5 tests from percentEncode1393[ RUN ] percentEncode.encodesUrlEncodedString1394[ OK ] percentEncode.encodesUrlEncodedString (0 ms)1395[ RUN ] percentEncode.keepArgument1396[ OK ] percentEncode.keepArgument (0 ms)1397[ RUN ] percentEncode.inverseOfDecode1398[ OK ] percentEncode.inverseOfDecode (0 ms)1399[ RUN ] percentEncode.trailingPercent1400[ OK ] percentEncode.trailingPercent (0 ms)1401[ RUN ] percentEncode.yen1402[ OK ] percentEncode.yen (0 ms)1403[----------] 5 tests from percentEncode (0 ms total)14041405[----------] 1 test from nix1406[ RUN ] nix.isValidSchemeName1407[ OK ] nix.isValidSchemeName (0 ms)1408[----------] 1 test from nix (0 ms total)14091410[----------] 3 tests from hasPrefix1411[ RUN ] hasPrefix.emptyStringHasNoPrefix1412[ OK ] hasPrefix.emptyStringHasNoPrefix (0 ms)1413[ RUN ] hasPrefix.emptyStringIsAlwaysPrefix1414[ OK ] hasPrefix.emptyStringIsAlwaysPrefix (0 ms)1415[ RUN ] hasPrefix.trivialCase1416[ OK ] hasPrefix.trivialCase (0 ms)1417[----------] 3 tests from hasPrefix (0 ms total)14181419[----------] 2 tests from hasSuffix1420[ RUN ] hasSuffix.emptyStringHasNoSuffix1421[ OK ] hasSuffix.emptyStringHasNoSuffix (0 ms)1422[ RUN ] hasSuffix.trivialCase1423[ OK ] hasSuffix.trivialCase (0 ms)1424[----------] 2 tests from hasSuffix (0 ms total)14251426[----------] 1 test from getLine1427[ RUN ] getLine.all1428[ OK ] getLine.all (0 ms)1429[----------] 1 test from getLine (0 ms total)14301431[----------] 3 tests from toLower1432[ RUN ] toLower.emptyString1433[ OK ] toLower.emptyString (0 ms)1434[ RUN ] toLower.nonLetters1435[ OK ] toLower.nonLetters (0 ms)1436[ RUN ] toLower.umlauts1437[ OK ] toLower.umlauts (0 ms)1438[----------] 3 tests from toLower (0 ms total)14391440[----------] 2 tests from string2Float1441[ RUN ] string2Float.emptyString1442[ OK ] string2Float.emptyString (0 ms)1443[ RUN ] string2Float.trivialConversions1444[ OK ] string2Float.trivialConversions (0 ms)1445[----------] 2 tests from string2Float (0 ms total)14461447[----------] 2 tests from string2Int1448[ RUN ] string2Int.emptyString1449[ OK ] string2Int.emptyString (0 ms)1450[ RUN ] string2Int.trivialConversions1451[ OK ] string2Int.trivialConversions (0 ms)1452[----------] 2 tests from string2Int (0 ms total)14531454[----------] 1 test from getSizeUnit1455[ RUN ] getSizeUnit.misc1456[ OK ] getSizeUnit.misc (0 ms)1457[----------] 1 test from getSizeUnit (0 ms total)14581459[----------] 1 test from getCommonSizeUnit1460[ RUN ] getCommonSizeUnit.misc1461[ OK ] getCommonSizeUnit.misc (0 ms)1462[----------] 1 test from getCommonSizeUnit (0 ms total)14631464[----------] 1 test from renderSizeWithoutUnit1465[ RUN ] renderSizeWithoutUnit.misc1466[ OK ] renderSizeWithoutUnit.misc (0 ms)1467[----------] 1 test from renderSizeWithoutUnit (0 ms total)14681469[----------] 1 test from renderSize1470[ RUN ] renderSize.misc1471[ OK ] renderSize.misc (0 ms)1472[----------] 1 test from renderSize (0 ms total)14731474[----------] 4 tests from rewriteStrings1475[ RUN ] rewriteStrings.emptyString1476[ OK ] rewriteStrings.emptyString (0 ms)1477[ RUN ] rewriteStrings.emptyRewrites1478[ OK ] rewriteStrings.emptyRewrites (0 ms)1479[ RUN ] rewriteStrings.successfulRewrite1480[ OK ] rewriteStrings.successfulRewrite (0 ms)1481[ RUN ] rewriteStrings.doesntOccur1482[ OK ] rewriteStrings.doesntOccur (0 ms)1483[----------] 4 tests from rewriteStrings (0 ms total)14841485[----------] 3 tests from replaceStrings1486[ RUN ] replaceStrings.emptyString1487[ OK ] replaceStrings.emptyString (0 ms)1488[ RUN ] replaceStrings.successfulReplace1489[ OK ] replaceStrings.successfulReplace (0 ms)1490[ RUN ] replaceStrings.doesntOccur1491[ OK ] replaceStrings.doesntOccur (0 ms)1492[----------] 3 tests from replaceStrings (0 ms total)14931494[----------] 2 tests from trim1495[ RUN ] trim.emptyString1496[ OK ] trim.emptyString (0 ms)1497[ RUN ] trim.removesWhitespace1498[ OK ] trim.removesWhitespace (0 ms)1499[----------] 2 tests from trim (0 ms total)15001501[----------] 2 tests from chomp1502[ RUN ] chomp.emptyString1503[ OK ] chomp.emptyString (0 ms)1504[ RUN ] chomp.removesWhitespace1505[ OK ] chomp.removesWhitespace (0 ms)1506[----------] 2 tests from chomp (0 ms total)15071508[----------] 4 tests from quoteStrings1509[ RUN ] quoteStrings.empty1510[ OK ] quoteStrings.empty (0 ms)1511[ RUN ] quoteStrings.emptyStrings1512[ OK ] quoteStrings.emptyStrings (0 ms)1513[ RUN ] quoteStrings.trivialQuote1514[ OK ] quoteStrings.trivialQuote (0 ms)1515[ RUN ] quoteStrings.quotedStrings1516[ OK ] quoteStrings.quotedStrings (0 ms)1517[----------] 4 tests from quoteStrings (0 ms total)15181519[----------] 2 tests from get1520[ RUN ] get.emptyContainer1521[ OK ] get.emptyContainer (0 ms)1522[ RUN ] get.getFromContainer1523[ OK ] get.getFromContainer (0 ms)1524[----------] 2 tests from get (0 ms total)15251526[----------] 2 tests from getOr1527[ RUN ] getOr.emptyContainer1528[ OK ] getOr.emptyContainer (0 ms)1529[ RUN ] getOr.getFromContainer1530[ OK ] getOr.getFromContainer (0 ms)1531[----------] 2 tests from getOr (0 ms total)15321533[----------] 4 tests from markLast1534[ RUN ] markLast.empty1535[ OK ] markLast.empty (0 ms)1536[ RUN ] markLast.singleElement1537[ OK ] markLast.singleElement (0 ms)1538[ RUN ] markLast.multipleElements1539[ OK ] markLast.multipleElements (0 ms)1540[ RUN ] markLast.mutateThroughReference1541[ OK ] markLast.mutateThroughReference (0 ms)1542[----------] 4 tests from markLast (0 ms total)15431544[----------] 1 test from stringsToCharPtrs1545[ RUN ] stringsToCharPtrs.rejectsNulBytes1546[ OK ] stringsToCharPtrs.rejectsNulBytes (0 ms)1547[----------] 1 test from stringsToCharPtrs (0 ms total)15481549[----------] 8 tests from XMLWriter1550[ RUN ] XMLWriter.emptyObject1551[ OK ] XMLWriter.emptyObject (0 ms)1552[ RUN ] XMLWriter.objectWithEmptyElement1553[ OK ] XMLWriter.objectWithEmptyElement (0 ms)1554[ RUN ] XMLWriter.objectWithElementWithAttrs1555[ OK ] XMLWriter.objectWithElementWithAttrs (0 ms)1556[ RUN ] XMLWriter.objectWithElementWithEmptyAttrs1557[ OK ] XMLWriter.objectWithElementWithEmptyAttrs (0 ms)1558[ RUN ] XMLWriter.objectWithElementWithAttrsEscaping1559[ OK ] XMLWriter.objectWithElementWithAttrsEscaping (0 ms)1560[ RUN ] XMLWriter.objectWithElementWithAttrsIndented1561[ OK ] XMLWriter.objectWithElementWithAttrsIndented (0 ms)1562[ RUN ] XMLWriter.writeEmptyElement1563[ OK ] XMLWriter.writeEmptyElement (0 ms)1564[ RUN ] XMLWriter.writeEmptyElementWithAttributes1565[ OK ] XMLWriter.writeEmptyElementWithAttributes (0 ms)1566[----------] 8 tests from XMLWriter (0 ms total)15671568[----------] 2 tests from closeExtraFDs1569[ RUN ] closeExtraFDs.works1570[ OK ] closeExtraFDs.works (1 ms)1571[ RUN ] closeExtraFDs.keepExtra1572[ OK ] closeExtraFDs.keepExtra (2 ms)1573[----------] 2 tests from closeExtraFDs (4 ms total)15741575[----------] 1 test from fchmodatTryNoFollow1576[ RUN ] fchmodatTryNoFollow.works1577[ OK ] fchmodatTryNoFollow.works (1 ms)1578[----------] 1 test from fchmodatTryNoFollow (1 ms total)15791580[----------] 1 test from deletePath1581[ RUN ] deletePath.restrictiveDirectoryPermissions1582[ OK ] deletePath.restrictiveDirectoryPermissions (2 ms)1583[----------] 1 test from deletePath (2 ms total)15841585[----------] 2 tests from MessageWithFds1586[ RUN ] MessageWithFds.streamWithData1587[ OK ] MessageWithFds.streamWithData (1 ms)1588[ RUN ] MessageWithFds.datagramEmptyData1589[ OK ] MessageWithFds.datagramEmptyData (1 ms)1590[----------] 2 tests from MessageWithFds (2 ms total)15911592[----------] 3 tests from UnixDomainSocketLongPath1593[ RUN ] UnixDomainSocketLongPath.bindConnectRoundtrip1594[ OK ] UnixDomainSocketLongPath.bindConnectRoundtrip (3 ms)1595[ RUN ] UnixDomainSocketLongPath.bindRejectsTooLongBasename1596[ OK ] UnixDomainSocketLongPath.bindRejectsTooLongBasename (1 ms)1597[ RUN ] UnixDomainSocketLongPath.nearLimitBasenameRoundtrip1598[ OK ] UnixDomainSocketLongPath.nearLimitBasenameRoundtrip (6 ms)1599[----------] 3 tests from UnixDomainSocketLongPath (11 ms total)16001601[----------] 2 tests from RootDeletePath1602[ RUN ] RootDeletePath.restrictiveDirectoryPermissions1603../darwin/file-system.cc:18: Failure1604Expected equality of these values:1605 geteuid()1606 Which is: 4081607 01608Run Root* tests as root16091610[ FAILED ] RootDeletePath.restrictiveDirectoryPermissions (0 ms)1611[ RUN ] RootDeletePath.modeChangesDenied1612../darwin/file-system.cc:18: Failure1613Expected equality of these values:1614 geteuid()1615 Which is: 4081616 01617Run Root* tests as root16181619[ FAILED ] RootDeletePath.modeChangesDenied (0 ms)1620[----------] 2 tests from RootDeletePath (0 ms total)16211622[----------] 8 tests from NarTest/InvalidNarTest1623[ RUN ] NarTest/InvalidNarTest.throwsErrorMessage/01624[ OK ] NarTest/InvalidNarTest.throwsErrorMessage/0 (0 ms)1625[ RUN ] NarTest/InvalidNarTest.throwsErrorMessage/11626[ OK ] NarTest/InvalidNarTest.throwsErrorMessage/1 (0 ms)1627[ RUN ] NarTest/InvalidNarTest.throwsErrorMessage/21628[ OK ] NarTest/InvalidNarTest.throwsErrorMessage/2 (0 ms)1629[ RUN ] NarTest/InvalidNarTest.throwsErrorMessage/31630[ OK ] NarTest/InvalidNarTest.throwsErrorMessage/3 (0 ms)1631[ RUN ] NarTest/InvalidNarTest.throwsErrorMessage/41632[ OK ] NarTest/InvalidNarTest.throwsErrorMessage/4 (0 ms)1633[ RUN ] NarTest/InvalidNarTest.throwsErrorMessage/51634[ OK ] NarTest/InvalidNarTest.throwsErrorMessage/5 (0 ms)1635[ RUN ] NarTest/InvalidNarTest.throwsErrorMessage/61636[ OK ] NarTest/InvalidNarTest.throwsErrorMessage/6 (0 ms)1637[ RUN ] NarTest/InvalidNarTest.throwsErrorMessage/71638[ OK ] NarTest/InvalidNarTest.throwsErrorMessage/7 (0 ms)1639[----------] 8 tests from NarTest/InvalidNarTest (0 ms total)16401641[----------] 5 tests from Sha512Paddings/Base64TrailParseTest1642[ RUN ] Sha512Paddings/Base64TrailParseTest.AcceptsVariousSha512Paddings/01643[ OK ] Sha512Paddings/Base64TrailParseTest.AcceptsVariousSha512Paddings/0 (0 ms)1644[ RUN ] Sha512Paddings/Base64TrailParseTest.AcceptsVariousSha512Paddings/11645[ OK ] Sha512Paddings/Base64TrailParseTest.AcceptsVariousSha512Paddings/1 (0 ms)1646[ RUN ] Sha512Paddings/Base64TrailParseTest.AcceptsVariousSha512Paddings/21647[ OK ] Sha512Paddings/Base64TrailParseTest.AcceptsVariousSha512Paddings/2 (0 ms)1648[ RUN ] Sha512Paddings/Base64TrailParseTest.AcceptsVariousSha512Paddings/31649[ OK ] Sha512Paddings/Base64TrailParseTest.AcceptsVariousSha512Paddings/3 (0 ms)1650[ RUN ] Sha512Paddings/Base64TrailParseTest.AcceptsVariousSha512Paddings/41651[ OK ] Sha512Paddings/Base64TrailParseTest.AcceptsVariousSha512Paddings/4 (0 ms)1652[----------] 5 tests from Sha512Paddings/Base64TrailParseTest (0 ms total)16531654[----------] 30 tests from CompressionDecompression/CompressionDecompressionTest1655[ RUN ] CompressionDecompression/CompressionDecompressionTest.roundtrip/none1656[ OK ] CompressionDecompression/CompressionDecompressionTest.roundtrip/none (0 ms)1657[ RUN ] CompressionDecompression/CompressionDecompressionTest.roundtrip/xz1658[ OK ] CompressionDecompression/CompressionDecompressionTest.roundtrip/xz (1 ms)1659[ RUN ] CompressionDecompression/CompressionDecompressionTest.roundtrip/bzip21660[ OK ] CompressionDecompression/CompressionDecompressionTest.roundtrip/bzip2 (0 ms)1661[ RUN ] CompressionDecompression/CompressionDecompressionTest.roundtrip/br1662[ OK ] CompressionDecompression/CompressionDecompressionTest.roundtrip/br (0 ms)1663[ RUN ] CompressionDecompression/CompressionDecompressionTest.roundtrip/zstd1664[ OK ] CompressionDecompression/CompressionDecompressionTest.roundtrip/zstd (0 ms)1665[ RUN ] CompressionDecompression/CompressionDecompressionTest.empty/none1666[ OK ] CompressionDecompression/CompressionDecompressionTest.empty/none (0 ms)1667[ RUN ] CompressionDecompression/CompressionDecompressionTest.empty/xz1668[ OK ] CompressionDecompression/CompressionDecompressionTest.empty/xz (0 ms)1669[ RUN ] CompressionDecompression/CompressionDecompressionTest.empty/bzip21670[ OK ] CompressionDecompression/CompressionDecompressionTest.empty/bzip2 (0 ms)1671[ RUN ] CompressionDecompression/CompressionDecompressionTest.empty/br1672[ OK ] CompressionDecompression/CompressionDecompressionTest.empty/br (0 ms)1673[ RUN ] CompressionDecompression/CompressionDecompressionTest.empty/zstd1674[ OK ] CompressionDecompression/CompressionDecompressionTest.empty/zstd (0 ms)1675[ RUN ] CompressionDecompression/CompressionDecompressionTest.invalidDecompression/none1676../compression.cc:42: Skipped167716781679[ SKIPPED ] CompressionDecompression/CompressionDecompressionTest.invalidDecompression/none (0 ms)1680[ RUN ] CompressionDecompression/CompressionDecompressionTest.invalidDecompression/xz1681[ OK ] CompressionDecompression/CompressionDecompressionTest.invalidDecompression/xz (0 ms)1682[ RUN ] CompressionDecompression/CompressionDecompressionTest.invalidDecompression/bzip21683[ OK ] CompressionDecompression/CompressionDecompressionTest.invalidDecompression/bzip2 (0 ms)1684[ RUN ] CompressionDecompression/CompressionDecompressionTest.invalidDecompression/br1685[ OK ] CompressionDecompression/CompressionDecompressionTest.invalidDecompression/br (0 ms)1686[ RUN ] CompressionDecompression/CompressionDecompressionTest.invalidDecompression/zstd1687[ OK ] CompressionDecompression/CompressionDecompressionTest.invalidDecompression/zstd (0 ms)1688[ RUN ] CompressionDecompression/CompressionDecompressionTest.emptyInputDecompressesToEmpty/none1689[ OK ] CompressionDecompression/CompressionDecompressionTest.emptyInputDecompressesToEmpty/none (0 ms)1690[ RUN ] CompressionDecompression/CompressionDecompressionTest.emptyInputDecompressesToEmpty/xz1691[ OK ] CompressionDecompression/CompressionDecompressionTest.emptyInputDecompressesToEmpty/xz (0 ms)1692[ RUN ] CompressionDecompression/CompressionDecompressionTest.emptyInputDecompressesToEmpty/bzip21693[ OK ] CompressionDecompression/CompressionDecompressionTest.emptyInputDecompressesToEmpty/bzip2 (0 ms)1694[ RUN ] CompressionDecompression/CompressionDecompressionTest.emptyInputDecompressesToEmpty/br1695[ OK ] CompressionDecompression/CompressionDecompressionTest.emptyInputDecompressesToEmpty/br (0 ms)1696[ RUN ] CompressionDecompression/CompressionDecompressionTest.emptyInputDecompressesToEmpty/zstd1697[ OK ] CompressionDecompression/CompressionDecompressionTest.emptyInputDecompressesToEmpty/zstd (0 ms)1698[ RUN ] CompressionDecompression/CompressionDecompressionTest.truncatedInputIsRejected/none1699../compression.cc:63: Skipped170017011702[ SKIPPED ] CompressionDecompression/CompressionDecompressionTest.truncatedInputIsRejected/none (0 ms)1703[ RUN ] CompressionDecompression/CompressionDecompressionTest.truncatedInputIsRejected/xz1704[ OK ] CompressionDecompression/CompressionDecompressionTest.truncatedInputIsRejected/xz (0 ms)1705[ RUN ] CompressionDecompression/CompressionDecompressionTest.truncatedInputIsRejected/bzip21706[ OK ] CompressionDecompression/CompressionDecompressionTest.truncatedInputIsRejected/bzip2 (0 ms)1707[ RUN ] CompressionDecompression/CompressionDecompressionTest.truncatedInputIsRejected/br1708[ OK ] CompressionDecompression/CompressionDecompressionTest.truncatedInputIsRejected/br (0 ms)1709[ RUN ] CompressionDecompression/CompressionDecompressionTest.truncatedInputIsRejected/zstd1710[ OK ] CompressionDecompression/CompressionDecompressionTest.truncatedInputIsRejected/zstd (0 ms)1711[ RUN ] CompressionDecompression/CompressionDecompressionTest.roundtripsWithSourceAndSink/none1712[ OK ] CompressionDecompression/CompressionDecompressionTest.roundtripsWithSourceAndSink/none (0 ms)1713[ RUN ] CompressionDecompression/CompressionDecompressionTest.roundtripsWithSourceAndSink/xz1714[ OK ] CompressionDecompression/CompressionDecompressionTest.roundtripsWithSourceAndSink/xz (0 ms)1715[ RUN ] CompressionDecompression/CompressionDecompressionTest.roundtripsWithSourceAndSink/bzip21716[ OK ] CompressionDecompression/CompressionDecompressionTest.roundtripsWithSourceAndSink/bzip2 (0 ms)1717[ RUN ] CompressionDecompression/CompressionDecompressionTest.roundtripsWithSourceAndSink/br1718[ OK ] CompressionDecompression/CompressionDecompressionTest.roundtripsWithSourceAndSink/br (0 ms)1719[ RUN ] CompressionDecompression/CompressionDecompressionTest.roundtripsWithSourceAndSink/zstd1720[ OK ] CompressionDecompression/CompressionDecompressionTest.roundtripsWithSourceAndSink/zstd (0 ms)1721[----------] 30 tests from CompressionDecompression/CompressionDecompressionTest (4 ms total)17221723[----------] 20 tests from CopyFdRange/CopyFdRangeTest1724[ RUN ] CopyFdRange/CopyFdRangeTest.regularToRegular/slow_nonregular1725[ OK ] CopyFdRange/CopyFdRangeTest.regularToRegular/slow_nonregular (0 ms)1726[ RUN ] CopyFdRange/CopyFdRangeTest.regularToRegular/slow_regular1727[ OK ] CopyFdRange/CopyFdRangeTest.regularToRegular/slow_regular (0 ms)1728[ RUN ] CopyFdRange/CopyFdRangeTest.regularToRegular/fast_nonregular1729[ OK ] CopyFdRange/CopyFdRangeTest.regularToRegular/fast_nonregular (0 ms)1730[ RUN ] CopyFdRange/CopyFdRangeTest.regularToRegular/fast_regular1731[ OK ] CopyFdRange/CopyFdRangeTest.regularToRegular/fast_regular (0 ms)1732[ RUN ] CopyFdRange/CopyFdRangeTest.offsetWorks/slow_nonregular1733[ OK ] CopyFdRange/CopyFdRangeTest.offsetWorks/slow_nonregular (0 ms)1734[ RUN ] CopyFdRange/CopyFdRangeTest.offsetWorks/slow_regular1735[ OK ] CopyFdRange/CopyFdRangeTest.offsetWorks/slow_regular (0 ms)1736[ RUN ] CopyFdRange/CopyFdRangeTest.offsetWorks/fast_nonregular1737[ OK ] CopyFdRange/CopyFdRangeTest.offsetWorks/fast_nonregular (0 ms)1738[ RUN ] CopyFdRange/CopyFdRangeTest.offsetWorks/fast_regular1739[ OK ] CopyFdRange/CopyFdRangeTest.offsetWorks/fast_regular (0 ms)1740[ RUN ] CopyFdRange/CopyFdRangeTest.endOfFile/slow_nonregular1741[ OK ] CopyFdRange/CopyFdRangeTest.endOfFile/slow_nonregular (0 ms)1742[ RUN ] CopyFdRange/CopyFdRangeTest.endOfFile/slow_regular1743[ OK ] CopyFdRange/CopyFdRangeTest.endOfFile/slow_regular (0 ms)1744[ RUN ] CopyFdRange/CopyFdRangeTest.endOfFile/fast_nonregular1745[ OK ] CopyFdRange/CopyFdRangeTest.endOfFile/fast_nonregular (0 ms)1746[ RUN ] CopyFdRange/CopyFdRangeTest.endOfFile/fast_regular1747[ OK ] CopyFdRange/CopyFdRangeTest.endOfFile/fast_regular (0 ms)1748[ RUN ] CopyFdRange/CopyFdRangeTest.toPipe/slow_nonregular1749[ OK ] CopyFdRange/CopyFdRangeTest.toPipe/slow_nonregular (0 ms)1750[ RUN ] CopyFdRange/CopyFdRangeTest.toPipe/slow_regular1751[ OK ] CopyFdRange/CopyFdRangeTest.toPipe/slow_regular (0 ms)1752[ RUN ] CopyFdRange/CopyFdRangeTest.toPipe/fast_nonregular1753[ OK ] CopyFdRange/CopyFdRangeTest.toPipe/fast_nonregular (0 ms)1754[ RUN ] CopyFdRange/CopyFdRangeTest.toPipe/fast_regular1755[ OK ] CopyFdRange/CopyFdRangeTest.toPipe/fast_regular (0 ms)1756[ RUN ] CopyFdRange/CopyFdRangeTest.nonSeekableInput/slow_nonregular1757[ OK ] CopyFdRange/CopyFdRangeTest.nonSeekableInput/slow_nonregular (0 ms)1758[ RUN ] CopyFdRange/CopyFdRangeTest.nonSeekableInput/slow_regular1759[ OK ] CopyFdRange/CopyFdRangeTest.nonSeekableInput/slow_regular (0 ms)1760[ RUN ] CopyFdRange/CopyFdRangeTest.nonSeekableInput/fast_nonregular1761[ OK ] CopyFdRange/CopyFdRangeTest.nonSeekableInput/fast_nonregular (0 ms)1762[ RUN ] CopyFdRange/CopyFdRangeTest.nonSeekableInput/fast_regular1763[ OK ] CopyFdRange/CopyFdRangeTest.nonSeekableInput/fast_regular (0 ms)1764[----------] 20 tests from CopyFdRange/CopyFdRangeTest (8 ms total)17651766[----------] 4 tests from HashJSON/HashJsonTest1767[ RUN ] HashJSON/HashJsonTest.from_json/01768[ OK ] HashJSON/HashJsonTest.from_json/0 (0 ms)1769[ RUN ] HashJSON/HashJsonTest.from_json/11770[ OK ] HashJSON/HashJsonTest.from_json/1 (0 ms)1771[ RUN ] HashJSON/HashJsonTest.to_json/01772[ OK ] HashJSON/HashJsonTest.to_json/0 (0 ms)1773[ RUN ] HashJSON/HashJsonTest.to_json/11774[ OK ] HashJSON/HashJsonTest.to_json/1 (0 ms)1775[----------] 4 tests from HashJSON/HashJsonTest (0 ms total)17761777[----------] 2 tests from BLAKE3HashJSON/BLAKE3HashJsonTest1778[ RUN ] BLAKE3HashJSON/BLAKE3HashJsonTest.from_json/01779[ OK ] BLAKE3HashJSON/BLAKE3HashJsonTest.from_json/0 (0 ms)1780[ RUN ] BLAKE3HashJSON/BLAKE3HashJsonTest.to_json/01781[ OK ] BLAKE3HashJSON/BLAKE3HashJsonTest.to_json/0 (0 ms)1782[----------] 2 tests from BLAKE3HashJSON/BLAKE3HashJsonTest (0 ms total)17831784[----------] 2 tests from JSONLogMessageCharacterisation/JSONLogMessageCharacterisationTest1785[ RUN ] JSONLogMessageCharacterisation/JSONLogMessageCharacterisationTest.writesExpectedLogs/01786[ OK ] JSONLogMessageCharacterisation/JSONLogMessageCharacterisationTest.writesExpectedLogs/0 (0 ms)1787[ RUN ] JSONLogMessageCharacterisation/JSONLogMessageCharacterisationTest.writesExpectedLogs/11788[ OK ] JSONLogMessageCharacterisation/JSONLogMessageCharacterisationTest.writesExpectedLogs/1 (0 ms)1789[----------] 2 tests from JSONLogMessageCharacterisation/JSONLogMessageCharacterisationTest (0 ms total)17901791[----------] 4 tests from MemorySourceAccessorJSON/MemorySourceAccessorJsonTest1792[ RUN ] MemorySourceAccessorJSON/MemorySourceAccessorJsonTest.from_json/01793[ OK ] MemorySourceAccessorJSON/MemorySourceAccessorJsonTest.from_json/0 (0 ms)1794[ RUN ] MemorySourceAccessorJSON/MemorySourceAccessorJsonTest.from_json/11795[ OK ] MemorySourceAccessorJSON/MemorySourceAccessorJsonTest.from_json/1 (0 ms)1796[ RUN ] MemorySourceAccessorJSON/MemorySourceAccessorJsonTest.to_json/01797[ OK ] MemorySourceAccessorJSON/MemorySourceAccessorJsonTest.to_json/0 (0 ms)1798[ RUN ] MemorySourceAccessorJSON/MemorySourceAccessorJsonTest.to_json/11799[ OK ] MemorySourceAccessorJSON/MemorySourceAccessorJsonTest.to_json/1 (0 ms)1800[----------] 4 tests from MemorySourceAccessorJSON/MemorySourceAccessorJsonTest (0 ms total)18011802[----------] 2 tests from NarListingJSON/NarListingJsonTest1803[ RUN ] NarListingJSON/NarListingJsonTest.from_json/01804[ OK ] NarListingJSON/NarListingJsonTest.from_json/0 (0 ms)1805[ RUN ] NarListingJSON/NarListingJsonTest.to_json/01806[ OK ] NarListingJSON/NarListingJsonTest.to_json/0 (0 ms)1807[----------] 2 tests from NarListingJSON/NarListingJsonTest (0 ms total)18081809[----------] 2 tests from ShallowNarListingJSON/ShallowNarListingJsonTest1810[ RUN ] ShallowNarListingJSON/ShallowNarListingJsonTest.from_json/01811[ OK ] ShallowNarListingJSON/ShallowNarListingJsonTest.from_json/0 (0 ms)1812[ RUN ] ShallowNarListingJSON/ShallowNarListingJsonTest.to_json/01813[ OK ] ShallowNarListingJSON/ShallowNarListingJsonTest.to_json/0 (0 ms)1814[----------] 2 tests from ShallowNarListingJSON/ShallowNarListingJsonTest (0 ms total)18151816[----------] 40 tests from PeekSort/RandomPeekSort1817[ RUN ] PeekSort/RandomPeekSort.defaultComparator/01818[ OK ] PeekSort/RandomPeekSort.defaultComparator/0 (1 ms)1819[ RUN ] PeekSort/RandomPeekSort.defaultComparator/11820[ OK ] PeekSort/RandomPeekSort.defaultComparator/1 (19 ms)1821[ RUN ] PeekSort/RandomPeekSort.defaultComparator/21822[ OK ] PeekSort/RandomPeekSort.defaultComparator/2 (13 ms)1823[ RUN ] PeekSort/RandomPeekSort.defaultComparator/31824[ OK ] PeekSort/RandomPeekSort.defaultComparator/3 (23 ms)1825[ RUN ] PeekSort/RandomPeekSort.defaultComparator/41826[ OK ] PeekSort/RandomPeekSort.defaultComparator/4 (38 ms)1827[ RUN ] PeekSort/RandomPeekSort.defaultComparator/51828[ OK ] PeekSort/RandomPeekSort.defaultComparator/5 (7 ms)1829[ RUN ] PeekSort/RandomPeekSort.defaultComparator/61830[ OK ] PeekSort/RandomPeekSort.defaultComparator/6 (0 ms)1831[ RUN ] PeekSort/RandomPeekSort.defaultComparator/71832[ OK ] PeekSort/RandomPeekSort.defaultComparator/7 (0 ms)1833[ RUN ] PeekSort/RandomPeekSort.defaultComparator/81834[ OK ] PeekSort/RandomPeekSort.defaultComparator/8 (0 ms)1835[ RUN ] PeekSort/RandomPeekSort.defaultComparator/91836[ OK ] PeekSort/RandomPeekSort.defaultComparator/9 (162 ms)1837[ RUN ] PeekSort/RandomPeekSort.greater/01838[ OK ] PeekSort/RandomPeekSort.greater/0 (1 ms)1839[ RUN ] PeekSort/RandomPeekSort.greater/11840[ OK ] PeekSort/RandomPeekSort.greater/1 (26 ms)1841[ RUN ] PeekSort/RandomPeekSort.greater/21842[ OK ] PeekSort/RandomPeekSort.greater/2 (11 ms)1843[ RUN ] PeekSort/RandomPeekSort.greater/31844[ OK ] PeekSort/RandomPeekSort.greater/3 (23 ms)1845[ RUN ] PeekSort/RandomPeekSort.greater/41846[ OK ] PeekSort/RandomPeekSort.greater/4 (31 ms)1847[ RUN ] PeekSort/RandomPeekSort.greater/51848[ OK ] PeekSort/RandomPeekSort.greater/5 (8 ms)1849[ RUN ] PeekSort/RandomPeekSort.greater/61850[ OK ] PeekSort/RandomPeekSort.greater/6 (0 ms)1851[ RUN ] PeekSort/RandomPeekSort.greater/71852[ OK ] PeekSort/RandomPeekSort.greater/7 (0 ms)1853[ RUN ] PeekSort/RandomPeekSort.greater/81854[ OK ] PeekSort/RandomPeekSort.greater/8 (0 ms)1855[ RUN ] PeekSort/RandomPeekSort.greater/91856[ OK ] PeekSort/RandomPeekSort.greater/9 (159 ms)1857[ RUN ] PeekSort/RandomPeekSort.brokenComparator/01858[ OK ] PeekSort/RandomPeekSort.brokenComparator/0 (4 ms)1859[ RUN ] PeekSort/RandomPeekSort.brokenComparator/11860[ OK ] PeekSort/RandomPeekSort.brokenComparator/1 (51 ms)1861[ RUN ] PeekSort/RandomPeekSort.brokenComparator/21862[ OK ] PeekSort/RandomPeekSort.brokenComparator/2 (33 ms)1863[ RUN ] PeekSort/RandomPeekSort.brokenComparator/31864[ OK ] PeekSort/RandomPeekSort.brokenComparator/3 (47 ms)1865[ RUN ] PeekSort/RandomPeekSort.brokenComparator/41866[ OK ] PeekSort/RandomPeekSort.brokenComparator/4 (70 ms)1867[ RUN ] PeekSort/RandomPeekSort.brokenComparator/51868[ OK ] PeekSort/RandomPeekSort.brokenComparator/5 (24 ms)1869[ RUN ] PeekSort/RandomPeekSort.brokenComparator/61870[ OK ] PeekSort/RandomPeekSort.brokenComparator/6 (0 ms)1871[ RUN ] PeekSort/RandomPeekSort.brokenComparator/71872[ OK ] PeekSort/RandomPeekSort.brokenComparator/7 (0 ms)1873[ RUN ] PeekSort/RandomPeekSort.brokenComparator/81874[ OK ] PeekSort/RandomPeekSort.brokenComparator/8 (0 ms)1875[ RUN ] PeekSort/RandomPeekSort.brokenComparator/91876[ OK ] PeekSort/RandomPeekSort.brokenComparator/9 (395 ms)1877[ RUN ] PeekSort/RandomPeekSort.stability/01878[ OK ] PeekSort/RandomPeekSort.stability/0 (2 ms)1879[ RUN ] PeekSort/RandomPeekSort.stability/11880[ OK ] PeekSort/RandomPeekSort.stability/1 (33 ms)1881[ RUN ] PeekSort/RandomPeekSort.stability/21882[ OK ] PeekSort/RandomPeekSort.stability/2 (15 ms)1883[ RUN ] PeekSort/RandomPeekSort.stability/31884[ OK ] PeekSort/RandomPeekSort.stability/3 (26 ms)1885[ RUN ] PeekSort/RandomPeekSort.stability/41886[ OK ] PeekSort/RandomPeekSort.stability/4 (40 ms)1887[ RUN ] PeekSort/RandomPeekSort.stability/51888[ OK ] PeekSort/RandomPeekSort.stability/5 (12 ms)1889[ RUN ] PeekSort/RandomPeekSort.stability/61890[ OK ] PeekSort/RandomPeekSort.stability/6 (0 ms)1891[ RUN ] PeekSort/RandomPeekSort.stability/71892[ OK ] PeekSort/RandomPeekSort.stability/7 (0 ms)1893[ RUN ] PeekSort/RandomPeekSort.stability/81894[ OK ] PeekSort/RandomPeekSort.stability/8 (0 ms)1895[ RUN ] PeekSort/RandomPeekSort.stability/91896[ OK ] PeekSort/RandomPeekSort.stability/9 (191 ms)1897[----------] 40 tests from PeekSort/RandomPeekSort (1478 ms total)18981899[----------] 7 tests from LevenshteinDistance/LevenshteinDistanceTest1900[ RUN ] LevenshteinDistance/LevenshteinDistanceTest.CorrectlyComputed/01901[ OK ] LevenshteinDistance/LevenshteinDistanceTest.CorrectlyComputed/0 (0 ms)1902[ RUN ] LevenshteinDistance/LevenshteinDistanceTest.CorrectlyComputed/11903[ OK ] LevenshteinDistance/LevenshteinDistanceTest.CorrectlyComputed/1 (0 ms)1904[ RUN ] LevenshteinDistance/LevenshteinDistanceTest.CorrectlyComputed/21905[ OK ] LevenshteinDistance/LevenshteinDistanceTest.CorrectlyComputed/2 (0 ms)1906[ RUN ] LevenshteinDistance/LevenshteinDistanceTest.CorrectlyComputed/31907[ OK ] LevenshteinDistance/LevenshteinDistanceTest.CorrectlyComputed/3 (0 ms)1908[ RUN ] LevenshteinDistance/LevenshteinDistanceTest.CorrectlyComputed/41909[ OK ] LevenshteinDistance/LevenshteinDistanceTest.CorrectlyComputed/4 (0 ms)1910[ RUN ] LevenshteinDistance/LevenshteinDistanceTest.CorrectlyComputed/51911[ OK ] LevenshteinDistance/LevenshteinDistanceTest.CorrectlyComputed/5 (0 ms)1912[ RUN ] LevenshteinDistance/LevenshteinDistanceTest.CorrectlyComputed/61913[ OK ] LevenshteinDistance/LevenshteinDistanceTest.CorrectlyComputed/6 (0 ms)1914[----------] 7 tests from LevenshteinDistance/LevenshteinDistanceTest (0 ms total)19151916[----------] 18 tests from TopoSort/TopoSortTest1917[ RUN ] TopoSort/TopoSortTest.ProducesCorrectResult/01918[ OK ] TopoSort/TopoSortTest.ProducesCorrectResult/0 (0 ms)1919[ RUN ] TopoSort/TopoSortTest.ProducesCorrectResult/11920[ OK ] TopoSort/TopoSortTest.ProducesCorrectResult/1 (0 ms)1921[ RUN ] TopoSort/TopoSortTest.ProducesCorrectResult/21922[ OK ] TopoSort/TopoSortTest.ProducesCorrectResult/2 (0 ms)1923[ RUN ] TopoSort/TopoSortTest.ProducesCorrectResult/31924[ OK ] TopoSort/TopoSortTest.ProducesCorrectResult/3 (0 ms)1925[ RUN ] TopoSort/TopoSortTest.ProducesCorrectResult/41926[ OK ] TopoSort/TopoSortTest.ProducesCorrectResult/4 (0 ms)1927[ RUN ] TopoSort/TopoSortTest.ProducesCorrectResult/51928[ OK ] TopoSort/TopoSortTest.ProducesCorrectResult/5 (0 ms)1929[ RUN ] TopoSort/TopoSortTest.ProducesCorrectResult/61930[ OK ] TopoSort/TopoSortTest.ProducesCorrectResult/6 (0 ms)1931[ RUN ] TopoSort/TopoSortTest.ProducesCorrectResult/71932[ OK ] TopoSort/TopoSortTest.ProducesCorrectResult/7 (0 ms)1933[ RUN ] TopoSort/TopoSortTest.ProducesCorrectResult/81934[ OK ] TopoSort/TopoSortTest.ProducesCorrectResult/8 (0 ms)1935[ RUN ] TopoSort/TopoSortTest.ProducesCorrectResult/91936[ OK ] TopoSort/TopoSortTest.ProducesCorrectResult/9 (0 ms)1937[ RUN ] TopoSort/TopoSortTest.ProducesCorrectResult/101938[ OK ] TopoSort/TopoSortTest.ProducesCorrectResult/10 (0 ms)1939[ RUN ] TopoSort/TopoSortTest.ProducesCorrectResult/111940[ OK ] TopoSort/TopoSortTest.ProducesCorrectResult/11 (0 ms)1941[ RUN ] TopoSort/TopoSortTest.ProducesCorrectResult/121942[ OK ] TopoSort/TopoSortTest.ProducesCorrectResult/12 (0 ms)1943[ RUN ] TopoSort/TopoSortTest.ProducesCorrectResult/131944[ OK ] TopoSort/TopoSortTest.ProducesCorrectResult/13 (0 ms)1945[ RUN ] TopoSort/TopoSortTest.ProducesCorrectResult/141946[ OK ] TopoSort/TopoSortTest.ProducesCorrectResult/14 (0 ms)1947[ RUN ] TopoSort/TopoSortTest.ProducesCorrectResult/151948[ OK ] TopoSort/TopoSortTest.ProducesCorrectResult/15 (0 ms)1949[ RUN ] TopoSort/TopoSortTest.ProducesCorrectResult/161950[ OK ] TopoSort/TopoSortTest.ProducesCorrectResult/16 (0 ms)1951[ RUN ] TopoSort/TopoSortTest.ProducesCorrectResult/171952[ OK ] TopoSort/TopoSortTest.ProducesCorrectResult/17 (0 ms)1953[----------] 18 tests from TopoSort/TopoSortTest (0 ms total)19541955[----------] 38 tests from FixGitURLs/FixGitURLTestSuite1956[ RUN ] FixGitURLs/FixGitURLTestSuite.parsesVariedGitUrls/01957[ OK ] FixGitURLs/FixGitURLTestSuite.parsesVariedGitUrls/0 (0 ms)1958[ RUN ] FixGitURLs/FixGitURLTestSuite.parsesVariedGitUrls/11959[ OK ] FixGitURLs/FixGitURLTestSuite.parsesVariedGitUrls/1 (0 ms)1960[ RUN ] FixGitURLs/FixGitURLTestSuite.parsesVariedGitUrls/21961[ OK ] FixGitURLs/FixGitURLTestSuite.parsesVariedGitUrls/2 (0 ms)1962[ RUN ] FixGitURLs/FixGitURLTestSuite.parsesVariedGitUrls/31963[ OK ] FixGitURLs/FixGitURLTestSuite.parsesVariedGitUrls/3 (0 ms)1964[ RUN ] FixGitURLs/FixGitURLTestSuite.parsesVariedGitUrls/41965[ OK ] FixGitURLs/FixGitURLTestSuite.parsesVariedGitUrls/4 (0 ms)1966[ RUN ] FixGitURLs/FixGitURLTestSuite.parsesVariedGitUrls/51967[ OK ] FixGitURLs/FixGitURLTestSuite.parsesVariedGitUrls/5 (0 ms)1968[ RUN ] FixGitURLs/FixGitURLTestSuite.parsesVariedGitUrls/61969[ OK ] FixGitURLs/FixGitURLTestSuite.parsesVariedGitUrls/6 (0 ms)1970[ RUN ] FixGitURLs/FixGitURLTestSuite.parsesVariedGitUrls/71971[ OK ] FixGitURLs/FixGitURLTestSuite.parsesVariedGitUrls/7 (0 ms)1972[ RUN ] FixGitURLs/FixGitURLTestSuite.parsesVariedGitUrls/81973[ OK ] FixGitURLs/FixGitURLTestSuite.parsesVariedGitUrls/8 (0 ms)1974[ RUN ] FixGitURLs/FixGitURLTestSuite.parsesVariedGitUrls/91975[ OK ] FixGitURLs/FixGitURLTestSuite.parsesVariedGitUrls/9 (0 ms)1976[ RUN ] FixGitURLs/FixGitURLTestSuite.parsesVariedGitUrls/101977[ OK ] FixGitURLs/FixGitURLTestSuite.parsesVariedGitUrls/10 (0 ms)1978[ RUN ] FixGitURLs/FixGitURLTestSuite.parsesVariedGitUrls/111979[ OK ] FixGitURLs/FixGitURLTestSuite.parsesVariedGitUrls/11 (0 ms)1980[ RUN ] FixGitURLs/FixGitURLTestSuite.parsesVariedGitUrls/121981[ OK ] FixGitURLs/FixGitURLTestSuite.parsesVariedGitUrls/12 (0 ms)1982[ RUN ] FixGitURLs/FixGitURLTestSuite.parsesVariedGitUrls/131983[ OK ] FixGitURLs/FixGitURLTestSuite.parsesVariedGitUrls/13 (0 ms)1984[ RUN ] FixGitURLs/FixGitURLTestSuite.parsesVariedGitUrls/141985[ OK ] FixGitURLs/FixGitURLTestSuite.parsesVariedGitUrls/14 (0 ms)1986[ RUN ] FixGitURLs/FixGitURLTestSuite.parsesVariedGitUrls/151987[ OK ] FixGitURLs/FixGitURLTestSuite.parsesVariedGitUrls/15 (0 ms)1988[ RUN ] FixGitURLs/FixGitURLTestSuite.parsesVariedGitUrls/161989[ OK ] FixGitURLs/FixGitURLTestSuite.parsesVariedGitUrls/16 (0 ms)1990[ RUN ] FixGitURLs/FixGitURLTestSuite.parsesVariedGitUrls/171991[ OK ] FixGitURLs/FixGitURLTestSuite.parsesVariedGitUrls/17 (0 ms)1992[ RUN ] FixGitURLs/FixGitURLTestSuite.parsesVariedGitUrls/181993[ OK ] FixGitURLs/FixGitURLTestSuite.parsesVariedGitUrls/18 (0 ms)1994[ RUN ] FixGitURLs/FixGitURLTestSuite.parsedNormalized/01995[ OK ] FixGitURLs/FixGitURLTestSuite.parsedNormalized/0 (0 ms)1996[ RUN ] FixGitURLs/FixGitURLTestSuite.parsedNormalized/11997[ OK ] FixGitURLs/FixGitURLTestSuite.parsedNormalized/1 (0 ms)1998[ RUN ] FixGitURLs/FixGitURLTestSuite.parsedNormalized/21999[ OK ] FixGitURLs/FixGitURLTestSuite.parsedNormalized/2 (0 ms)2000[ RUN ] FixGitURLs/FixGitURLTestSuite.parsedNormalized/32001[ OK ] FixGitURLs/FixGitURLTestSuite.parsedNormalized/3 (0 ms)2002[ RUN ] FixGitURLs/FixGitURLTestSuite.parsedNormalized/42003[ OK ] FixGitURLs/FixGitURLTestSuite.parsedNormalized/4 (0 ms)2004[ RUN ] FixGitURLs/FixGitURLTestSuite.parsedNormalized/52005[ OK ] FixGitURLs/FixGitURLTestSuite.parsedNormalized/5 (0 ms)2006[ RUN ] FixGitURLs/FixGitURLTestSuite.parsedNormalized/62007[ OK ] FixGitURLs/FixGitURLTestSuite.parsedNormalized/6 (0 ms)2008[ RUN ] FixGitURLs/FixGitURLTestSuite.parsedNormalized/72009[ OK ] FixGitURLs/FixGitURLTestSuite.parsedNormalized/7 (0 ms)2010[ RUN ] FixGitURLs/FixGitURLTestSuite.parsedNormalized/82011[ OK ] FixGitURLs/FixGitURLTestSuite.parsedNormalized/8 (0 ms)2012[ RUN ] FixGitURLs/FixGitURLTestSuite.parsedNormalized/92013[ OK ] FixGitURLs/FixGitURLTestSuite.parsedNormalized/9 (0 ms)2014[ RUN ] FixGitURLs/FixGitURLTestSuite.parsedNormalized/102015[ OK ] FixGitURLs/FixGitURLTestSuite.parsedNormalized/10 (0 ms)2016[ RUN ] FixGitURLs/FixGitURLTestSuite.parsedNormalized/112017[ OK ] FixGitURLs/FixGitURLTestSuite.parsedNormalized/11 (0 ms)2018[ RUN ] FixGitURLs/FixGitURLTestSuite.parsedNormalized/122019[ OK ] FixGitURLs/FixGitURLTestSuite.parsedNormalized/12 (0 ms)2020[ RUN ] FixGitURLs/FixGitURLTestSuite.parsedNormalized/132021[ OK ] FixGitURLs/FixGitURLTestSuite.parsedNormalized/13 (0 ms)2022[ RUN ] FixGitURLs/FixGitURLTestSuite.parsedNormalized/142023[ OK ] FixGitURLs/FixGitURLTestSuite.parsedNormalized/14 (0 ms)2024[ RUN ] FixGitURLs/FixGitURLTestSuite.parsedNormalized/152025[ OK ] FixGitURLs/FixGitURLTestSuite.parsedNormalized/15 (0 ms)2026[ RUN ] FixGitURLs/FixGitURLTestSuite.parsedNormalized/162027[ OK ] FixGitURLs/FixGitURLTestSuite.parsedNormalized/16 (0 ms)2028[ RUN ] FixGitURLs/FixGitURLTestSuite.parsedNormalized/172029[ OK ] FixGitURLs/FixGitURLTestSuite.parsedNormalized/17 (0 ms)2030[ RUN ] FixGitURLs/FixGitURLTestSuite.parsedNormalized/182031[ OK ] FixGitURLs/FixGitURLTestSuite.parsedNormalized/18 (0 ms)2032[----------] 38 tests from FixGitURLs/FixGitURLTestSuite (0 ms total)20332034[----------] 21 tests from ParseURLSuccessCases/ParseURLSuccess2035[ RUN ] ParseURLSuccessCases/ParseURLSuccess.parsesAsExpected/02036[ OK ] ParseURLSuccessCases/ParseURLSuccess.parsesAsExpected/0 (0 ms)2037[ RUN ] ParseURLSuccessCases/ParseURLSuccess.parsesAsExpected/12038[ OK ] ParseURLSuccessCases/ParseURLSuccess.parsesAsExpected/1 (0 ms)2039[ RUN ] ParseURLSuccessCases/ParseURLSuccess.parsesAsExpected/22040[ OK ] ParseURLSuccessCases/ParseURLSuccess.parsesAsExpected/2 (0 ms)2041[ RUN ] ParseURLSuccessCases/ParseURLSuccess.parsesAsExpected/32042[ OK ] ParseURLSuccessCases/ParseURLSuccess.parsesAsExpected/3 (0 ms)2043[ RUN ] ParseURLSuccessCases/ParseURLSuccess.parsesAsExpected/42044[ OK ] ParseURLSuccessCases/ParseURLSuccess.parsesAsExpected/4 (0 ms)2045[ RUN ] ParseURLSuccessCases/ParseURLSuccess.parsesAsExpected/52046[ OK ] ParseURLSuccessCases/ParseURLSuccess.parsesAsExpected/5 (0 ms)2047[ RUN ] ParseURLSuccessCases/ParseURLSuccess.parsesAsExpected/62048[ OK ] ParseURLSuccessCases/ParseURLSuccess.parsesAsExpected/6 (0 ms)2049[ RUN ] ParseURLSuccessCases/ParseURLSuccess.toStringRoundTrips/02050[ OK ] ParseURLSuccessCases/ParseURLSuccess.toStringRoundTrips/0 (0 ms)2051[ RUN ] ParseURLSuccessCases/ParseURLSuccess.toStringRoundTrips/12052[ OK ] ParseURLSuccessCases/ParseURLSuccess.toStringRoundTrips/1 (0 ms)2053[ RUN ] ParseURLSuccessCases/ParseURLSuccess.toStringRoundTrips/22054[ OK ] ParseURLSuccessCases/ParseURLSuccess.toStringRoundTrips/2 (0 ms)2055[ RUN ] ParseURLSuccessCases/ParseURLSuccess.toStringRoundTrips/32056[ OK ] ParseURLSuccessCases/ParseURLSuccess.toStringRoundTrips/3 (0 ms)2057[ RUN ] ParseURLSuccessCases/ParseURLSuccess.toStringRoundTrips/42058[ OK ] ParseURLSuccessCases/ParseURLSuccess.toStringRoundTrips/4 (0 ms)2059[ RUN ] ParseURLSuccessCases/ParseURLSuccess.toStringRoundTrips/52060[ OK ] ParseURLSuccessCases/ParseURLSuccess.toStringRoundTrips/5 (0 ms)2061[ RUN ] ParseURLSuccessCases/ParseURLSuccess.toStringRoundTrips/62062[ OK ] ParseURLSuccessCases/ParseURLSuccess.toStringRoundTrips/6 (0 ms)2063[ RUN ] ParseURLSuccessCases/ParseURLSuccess.makeSureFixGitURLDoesNotModify/02064[ OK ] ParseURLSuccessCases/ParseURLSuccess.makeSureFixGitURLDoesNotModify/0 (0 ms)2065[ RUN ] ParseURLSuccessCases/ParseURLSuccess.makeSureFixGitURLDoesNotModify/12066[ OK ] ParseURLSuccessCases/ParseURLSuccess.makeSureFixGitURLDoesNotModify/1 (0 ms)2067[ RUN ] ParseURLSuccessCases/ParseURLSuccess.makeSureFixGitURLDoesNotModify/22068[ OK ] ParseURLSuccessCases/ParseURLSuccess.makeSureFixGitURLDoesNotModify/2 (0 ms)2069[ RUN ] ParseURLSuccessCases/ParseURLSuccess.makeSureFixGitURLDoesNotModify/32070[ OK ] ParseURLSuccessCases/ParseURLSuccess.makeSureFixGitURLDoesNotModify/3 (0 ms)2071[ RUN ] ParseURLSuccessCases/ParseURLSuccess.makeSureFixGitURLDoesNotModify/42072[ OK ] ParseURLSuccessCases/ParseURLSuccess.makeSureFixGitURLDoesNotModify/4 (0 ms)2073[ RUN ] ParseURLSuccessCases/ParseURLSuccess.makeSureFixGitURLDoesNotModify/52074[ OK ] ParseURLSuccessCases/ParseURLSuccess.makeSureFixGitURLDoesNotModify/5 (0 ms)2075[ RUN ] ParseURLSuccessCases/ParseURLSuccess.makeSureFixGitURLDoesNotModify/62076[ OK ] ParseURLSuccessCases/ParseURLSuccess.makeSureFixGitURLDoesNotModify/6 (0 ms)2077[----------] 21 tests from ParseURLSuccessCases/ParseURLSuccess (0 ms total)20782079[----------] 17 tests from parseURLRelative/ParseURLRelativeTestSuite2080[ RUN ] parseURLRelative/ParseURLRelativeTestSuite.resolve/resolvesRelativePath2081[ OK ] parseURLRelative/ParseURLRelativeTestSuite.resolve/resolvesRelativePath (0 ms)2082[ RUN ] parseURLRelative/ParseURLRelativeTestSuite.resolve/baseUrlIpv6AddressWithoutZoneId2083[ OK ] parseURLRelative/ParseURLRelativeTestSuite.resolve/baseUrlIpv6AddressWithoutZoneId (0 ms)2084[ RUN ] parseURLRelative/ParseURLRelativeTestSuite.resolve/resolvesRelativePathIpv6AddressWithZoneId2085[ OK ] parseURLRelative/ParseURLRelativeTestSuite.resolve/resolvesRelativePathIpv6AddressWithZoneId (0 ms)2086[ RUN ] parseURLRelative/ParseURLRelativeTestSuite.resolve/resolvesRelativePathWithDot2087[ OK ] parseURLRelative/ParseURLRelativeTestSuite.resolve/resolvesRelativePathWithDot (0 ms)2088[ RUN ] parseURLRelative/ParseURLRelativeTestSuite.resolve/resolvesParentDirectory2089[ OK ] parseURLRelative/ParseURLRelativeTestSuite.resolve/resolvesParentDirectory (0 ms)2090[ RUN ] parseURLRelative/ParseURLRelativeTestSuite.resolve/resolvesParentDirectoryNotTrickedByEscapedSlash2091[ OK ] parseURLRelative/ParseURLRelativeTestSuite.resolve/resolvesParentDirectoryNotTrickedByEscapedSlash (0 ms)2092[ RUN ] parseURLRelative/ParseURLRelativeTestSuite.resolve/replacesPathWithAbsoluteRelative2093[ OK ] parseURLRelative/ParseURLRelativeTestSuite.resolve/replacesPathWithAbsoluteRelative (0 ms)2094[ RUN ] parseURLRelative/ParseURLRelativeTestSuite.resolve/keepsQueryAndFragmentFromRelative2095[ OK ] parseURLRelative/ParseURLRelativeTestSuite.resolve/keepsQueryAndFragmentFromRelative (0 ms)2096[ RUN ] parseURLRelative/ParseURLRelativeTestSuite.resolve/absOverride2097[ OK ] parseURLRelative/ParseURLRelativeTestSuite.resolve/absOverride (0 ms)2098[ RUN ] parseURLRelative/ParseURLRelativeTestSuite.resolve/absOverrideWithZoneId2099[ OK ] parseURLRelative/ParseURLRelativeTestSuite.resolve/absOverrideWithZoneId (0 ms)2100[ RUN ] parseURLRelative/ParseURLRelativeTestSuite.resolve/bothWithoutAuthority2101[ OK ] parseURLRelative/ParseURLRelativeTestSuite.resolve/bothWithoutAuthority (0 ms)2102[ RUN ] parseURLRelative/ParseURLRelativeTestSuite.resolve/emptyRelative2103[ OK ] parseURLRelative/ParseURLRelativeTestSuite.resolve/emptyRelative (0 ms)2104[ RUN ] parseURLRelative/ParseURLRelativeTestSuite.resolve/fragmentRelative2105[ OK ] parseURLRelative/ParseURLRelativeTestSuite.resolve/fragmentRelative (0 ms)2106[ RUN ] parseURLRelative/ParseURLRelativeTestSuite.resolve/emptyFragmentRelative2107[ OK ] parseURLRelative/ParseURLRelativeTestSuite.resolve/emptyFragmentRelative (0 ms)2108[ RUN ] parseURLRelative/ParseURLRelativeTestSuite.resolve/emptyQueryRelative2109[ OK ] parseURLRelative/ParseURLRelativeTestSuite.resolve/emptyQueryRelative (0 ms)2110[ RUN ] parseURLRelative/ParseURLRelativeTestSuite.resolve/queryRelative2111[ OK ] parseURLRelative/ParseURLRelativeTestSuite.resolve/queryRelative (0 ms)2112[ RUN ] parseURLRelative/ParseURLRelativeTestSuite.resolve/queryFragmentRelative2113[ OK ] parseURLRelative/ParseURLRelativeTestSuite.resolve/queryFragmentRelative (0 ms)2114[----------] 17 tests from parseURLRelative/ParseURLRelativeTestSuite (0 ms total)21152116[----------] 20 tests from ParsedURL/ParsedURLPathSegmentsTest2117[ RUN ] ParsedURL/ParsedURLPathSegmentsTest.segmentsAreCorrect/no_authority_empty_path2118[ OK ] ParsedURL/ParsedURLPathSegmentsTest.segmentsAreCorrect/no_authority_empty_path (0 ms)2119[ RUN ] ParsedURL/ParsedURLPathSegmentsTest.segmentsAreCorrect/empty_authority_empty_path2120[ OK ] ParsedURL/ParsedURLPathSegmentsTest.segmentsAreCorrect/empty_authority_empty_path (0 ms)2121[ RUN ] ParsedURL/ParsedURLPathSegmentsTest.segmentsAreCorrect/empty_authority_root_path2122[ OK ] ParsedURL/ParsedURLPathSegmentsTest.segmentsAreCorrect/empty_authority_root_path (0 ms)2123[ RUN ] ParsedURL/ParsedURLPathSegmentsTest.segmentsAreCorrect/empty_authority_empty_path_trailing2124[ OK ] ParsedURL/ParsedURLPathSegmentsTest.segmentsAreCorrect/empty_authority_empty_path_trailing (0 ms)2125[ RUN ] ParsedURL/ParsedURLPathSegmentsTest.segmentsAreCorrect/non_empty_authority_empty_path2126[ OK ] ParsedURL/ParsedURLPathSegmentsTest.segmentsAreCorrect/non_empty_authority_empty_path (0 ms)2127[ RUN ] ParsedURL/ParsedURLPathSegmentsTest.segmentsAreCorrect/non_empty_authority_non_empty_path2128[ OK ] ParsedURL/ParsedURLPathSegmentsTest.segmentsAreCorrect/non_empty_authority_non_empty_path (0 ms)2129[ RUN ] ParsedURL/ParsedURLPathSegmentsTest.segmentsAreCorrect/skip_all_empty_segments_with_authority2130[ OK ] ParsedURL/ParsedURLPathSegmentsTest.segmentsAreCorrect/skip_all_empty_segments_with_authority (0 ms)2131[ RUN ] ParsedURL/ParsedURLPathSegmentsTest.segmentsAreCorrect/empty_segments_with_authority2132[ OK ] ParsedURL/ParsedURLPathSegmentsTest.segmentsAreCorrect/empty_segments_with_authority (0 ms)2133[ RUN ] ParsedURL/ParsedURLPathSegmentsTest.segmentsAreCorrect/skip_all_empty_segments_no_authority_starts_with_slash2134[ OK ] ParsedURL/ParsedURLPathSegmentsTest.segmentsAreCorrect/skip_all_empty_segments_no_authority_starts_with_slash (0 ms)2135[ RUN ] ParsedURL/ParsedURLPathSegmentsTest.segmentsAreCorrect/skip_all_empty_segments_no_authority_doesnt_start_with_slash2136[ OK ] ParsedURL/ParsedURLPathSegmentsTest.segmentsAreCorrect/skip_all_empty_segments_no_authority_doesnt_start_with_slash (0 ms)2137[ RUN ] ParsedURL/ParsedURLPathSegmentsTest.to_string/no_authority_empty_path2138[ OK ] ParsedURL/ParsedURLPathSegmentsTest.to_string/no_authority_empty_path (0 ms)2139[ RUN ] ParsedURL/ParsedURLPathSegmentsTest.to_string/empty_authority_empty_path2140[ OK ] ParsedURL/ParsedURLPathSegmentsTest.to_string/empty_authority_empty_path (0 ms)2141[ RUN ] ParsedURL/ParsedURLPathSegmentsTest.to_string/empty_authority_root_path2142[ OK ] ParsedURL/ParsedURLPathSegmentsTest.to_string/empty_authority_root_path (0 ms)2143[ RUN ] ParsedURL/ParsedURLPathSegmentsTest.to_string/empty_authority_empty_path_trailing2144[ OK ] ParsedURL/ParsedURLPathSegmentsTest.to_string/empty_authority_empty_path_trailing (0 ms)2145[ RUN ] ParsedURL/ParsedURLPathSegmentsTest.to_string/non_empty_authority_empty_path2146[ OK ] ParsedURL/ParsedURLPathSegmentsTest.to_string/non_empty_authority_empty_path (0 ms)2147[ RUN ] ParsedURL/ParsedURLPathSegmentsTest.to_string/non_empty_authority_non_empty_path2148[ OK ] ParsedURL/ParsedURLPathSegmentsTest.to_string/non_empty_authority_non_empty_path (0 ms)2149[ RUN ] ParsedURL/ParsedURLPathSegmentsTest.to_string/skip_all_empty_segments_with_authority2150[ OK ] ParsedURL/ParsedURLPathSegmentsTest.to_string/skip_all_empty_segments_with_authority (0 ms)2151[ RUN ] ParsedURL/ParsedURLPathSegmentsTest.to_string/empty_segments_with_authority2152[ OK ] ParsedURL/ParsedURLPathSegmentsTest.to_string/empty_segments_with_authority (0 ms)2153[ RUN ] ParsedURL/ParsedURLPathSegmentsTest.to_string/skip_all_empty_segments_no_authority_starts_with_slash2154[ OK ] ParsedURL/ParsedURLPathSegmentsTest.to_string/skip_all_empty_segments_no_authority_starts_with_slash (0 ms)2155[ RUN ] ParsedURL/ParsedURLPathSegmentsTest.to_string/skip_all_empty_segments_no_authority_doesnt_start_with_slash2156[ OK ] ParsedURL/ParsedURLPathSegmentsTest.to_string/skip_all_empty_segments_no_authority_doesnt_start_with_slash (0 ms)2157[----------] 20 tests from ParsedURL/ParsedURLPathSegmentsTest (0 ms total)21582159[----------] 8 tests from Unix/UrlPathTest2160[ RUN ] Unix/UrlPathTest.pathToUrlPath/absolute_path2161[ OK ] Unix/UrlPathTest.pathToUrlPath/absolute_path (0 ms)2162[ RUN ] Unix/UrlPathTest.pathToUrlPath/root_path2163[ OK ] Unix/UrlPathTest.pathToUrlPath/root_path (0 ms)2164[ RUN ] Unix/UrlPathTest.urlPathToPath/absolute_path2165[ OK ] Unix/UrlPathTest.urlPathToPath/absolute_path (0 ms)2166[ RUN ] Unix/UrlPathTest.urlPathToPath/root_path2167[ OK ] Unix/UrlPathTest.urlPathToPath/root_path (0 ms)2168[ RUN ] Unix/UrlPathTest.urlToString/absolute_path2169[ OK ] Unix/UrlPathTest.urlToString/absolute_path (0 ms)2170[ RUN ] Unix/UrlPathTest.urlToString/root_path2171[ OK ] Unix/UrlPathTest.urlToString/root_path (0 ms)2172[ RUN ] Unix/UrlPathTest.stringToUrl/absolute_path2173[ OK ] Unix/UrlPathTest.stringToUrl/absolute_path (0 ms)2174[ RUN ] Unix/UrlPathTest.stringToUrl/root_path2175[ OK ] Unix/UrlPathTest.stringToUrl/root_path (0 ms)2176[----------] 8 tests from Unix/UrlPathTest (0 ms total)21772178[----------] Global test environment tear-down2179[==========] 833 tests from 159 test suites ran. (1757 ms total)2180[ PASSED ] 829 tests.2181[ SKIPPED ] 2 tests, listed below:2182[ SKIPPED ] CompressionDecompression/CompressionDecompressionTest.invalidDecompression/none2183[ SKIPPED ] CompressionDecompression/CompressionDecompressionTest.truncatedInputIsRejected/none2184[ FAILED ] 2 tests, listed below:2185[ FAILED ] RootDeletePath.restrictiveDirectoryPermissions2186[ FAILED ] RootDeletePath.modeChangesDenied21872188 2 FAILED TESTS2189 YOU HAVE 1 DISABLED TEST2190