setup
checks.aarch64-darwin.exit-stress
· build #670
· raw
1these 16 derivations will be built:2 /nix/store/h3r0flpklp0hpbrll2qni6q3i1651wlg-nix-util-test-support-2.36.0pre20261018_9d8ebdb5.drv3 /nix/store/l0k88r2lf3ifxpb53ggfwn4954vjl13i-nix-store-test-support-2.36.0pre20261018_9d8ebdb5.drv4 /nix/store/bdpkgpd1p0fmhyas4zfbv90bmb3g0h4r-nix-util-test-support-2.36.0pre20261018_9d8ebdb5.drv5 /nix/store/34079qik7w81xyfxg0xwc7k0ax06jfvp-nix-expr-tests-2.36.0pre20261018_9d8ebdb5.drv6 /nix/store/0dhj06blnbvlrw9l9n8mxwn1a97ksbyz-nix-expr-tests-run.drv7 /nix/store/8zc2v65fffr9hpizxbk8ngywl1b6j8dk-nix-store-tests-2.36.0pre20261018_9d8ebdb5.drv8 /nix/store/3cmnjfr2qsk313al1md8dzjplwia4axx-nix-store-tests-run.drv9 /nix/store/8j18iwl1cv2irlc43qxaz6m5igv4dn6w-nix-manual-2.36.0pre20261018_9d8ebdb5.drv10 /nix/store/96zb9qf961l07vkjw0krhv4flgz4i25v-nix-util-tests-2.36.0pre20261018_9d8ebdb5.drv11 /nix/store/f9i5b2cc6xn93ax13r8inhzbpp287vaa-nix-util-tests-run.drv12 /nix/store/w3mqi24v4k01w80dl0hpwr4n6rgdl35q-nix-fetchers-tests-2.36.0pre20261018_9d8ebdb5.drv13 /nix/store/hli5p3hl4n6lw25hx1dvw9wr0pxg9vk0-nix-fetchers-tests-run.drv14 /nix/store/k9g2fm2zy8965fa60b3qdd7g5mmyc42v-nix-flake-tests-2.36.0pre20261018_9d8ebdb5.drv15 /nix/store/zmvvwcdps876dygfmi5vx079hhfm3pvp-nix-flake-tests-run.drv16 /nix/store/xcr4prj4fvb9ai2yr0i92p4fzw5lradw-nix-2.36.0pre20261018_9d8ebdb5.drv17 /nix/store/h3j3nhzwqf0j0i35gf08wavx416lwm48-nix-grpc-store-exit-stress.drv18error: Cannot build '/nix/store/f9i5b2cc6xn93ax13r8inhzbpp287vaa-nix-util-tests-run.drv'.19 Reason: builder failed with exit code 1.20 Output paths:21 /nix/store/nqad003w6jyrdwj509zr9xnv4l938qj4-nix-util-tests-run22 Last 25 log lines:23 > [ RUN ] Unix/UrlPathTest.urlPathToPath/root_path24 > [ OK ] Unix/UrlPathTest.urlPathToPath/root_path (0 ms)25 > [ RUN ] Unix/UrlPathTest.urlToString/absolute_path26 > [ OK ] Unix/UrlPathTest.urlToString/absolute_path (0 ms)27 > [ RUN ] Unix/UrlPathTest.urlToString/root_path28 > [ OK ] Unix/UrlPathTest.urlToString/root_path (0 ms)29 > [ RUN ] Unix/UrlPathTest.stringToUrl/absolute_path30 > [ OK ] Unix/UrlPathTest.stringToUrl/absolute_path (0 ms)31 > [ RUN ] Unix/UrlPathTest.stringToUrl/root_path32 > [ OK ] Unix/UrlPathTest.stringToUrl/root_path (0 ms)33 > [----------] 8 tests from Unix/UrlPathTest (0 ms total)34 >35 > [----------] Global test environment tear-down36 > [==========] 833 tests from 159 test suites ran. (3242 ms total)37 > [ PASSED ] 829 tests.38 > [ SKIPPED ] 2 tests, listed below:39 > [ SKIPPED ] CompressionDecompression/CompressionDecompressionTest.invalidDecompression/none40 > [ SKIPPED ] CompressionDecompression/CompressionDecompressionTest.truncatedInputIsRejected/none41 > [ FAILED ] 2 tests, listed below:42 > [ FAILED ] RootDeletePath.restrictiveDirectoryPermissions43 > [ FAILED ] RootDeletePath.modeChangesDenied44 >45 > 2 FAILED TESTS46 > YOU HAVE 1 DISABLED TEST47 >48 For full logs, run:49 nix log /nix/store/f9i5b2cc6xn93ax13r8inhzbpp287vaa-nix-util-tests-run.drv50error: Cannot build '/nix/store/xcr4prj4fvb9ai2yr0i92p4fzw5lradw-nix-2.36.0pre20261018_9d8ebdb5.drv'.51 Reason: 1 dependency failed.52 Output paths:53 /nix/store/jmmc9s9055913ibs600y67my1k32cfc9-nix-2.36.0pre20261018_9d8ebdb5-dev54 /nix/store/lx5riyjyah0fvx9pqqaa0c518ah00n0l-nix-2.36.0pre20261018_9d8ebdb5-doc55 /nix/store/p383wyh041vy55qffbpkayq5mv2jwl62-nix-2.36.0pre20261018_9d8ebdb5-man56 /nix/store/xanivncg0gb420lnn3x3vk51i7x5xv3q-nix-2.36.0pre20261018_9d8ebdb557error: Cannot build '/nix/store/h3j3nhzwqf0j0i35gf08wavx416lwm48-nix-grpc-store-exit-stress.drv'.58 Reason: 1 dependency failed.59 Output paths:60 /nix/store/vhh211wzmsa8370c1xslcf15frjaa7n0-nix-grpc-store-exit-stress