nixbot

builds

Mic92/nix-grpc-store build #75 failed

branch main · PR #35 · commit 6df6d555b3 · · took 3m 16s · eval 16s

18 failed
failed attributes
status attribute duration
failed checks.aarch64-darwin.exit-stress 2m 27s
nix-expr-2.36.0pre20260901_72385de1+1: Checking for function "sysconf" : YES Run-time dependency Boost (found: container, context) found: YES 1.89.0 Run-time d …
nix-expr-2.36.0pre20260901_72385de1+1:
Checking for function "sysconf" : YES 
Run-time dependency Boost (found: container, context) found: YES 1.89.0
Run-time dependency nlohmann_json found: YES 3.12.0
Found CMake: /nix/store/pwml4akrsnl3ismgd778y5cc117zskk2-cmake-4.3.4/bin/cmake (4.3.4)
Run-time dependency sqlite3 found: NO (tried pkgconfig and framework)
Run-time dependency sqlite found: NO (tried pkgconfig, framework and cmake)
meson.build:56:9: ERROR: Dependency "sqlite" not found, tried pkgconfig, framework and cmake
A full log can be found at /nix/var/nix/builds/nix-75083-2120983615/source-patched-source/src/libexpr/build/meson-logs/meson-log.txt
dependency failed checks.aarch64-darwin.plugin-dispatcher
failed checks.aarch64-darwin.plugin-nix_2_31 20s
nix-grpc-store-0.1.0: 21 | class BackendError final : public nix::CloneableError<BackendError, nix::Error> | ^~~~~~~~~~~~ ../src/build-log.hh:21: …
nix-grpc-store-0.1.0:
   21 | class BackendError final : public nix::CloneableError<BackendError, nix::Error>
      |       ^~~~~~~~~~~~
../src/build-log.hh:21:7: note: candidate constructor (the implicit default constructor) not viable: requires 0 arguments, but 1 was provided
4 errors generated.
[7/11] Compiling C++ object nix-grpc-store.dylib.p/meson-generated_.._nix_remote.grpc.pb.cc.o
[8/11] Compiling C++ object nix-grpc-daemon.p/meson-generated_.._nix_remote.grpc.pb.cc.o
[9/11] Compiling C++ object nix-grpc-store.dylib.p/src_grpc-store.cc.o
ninja: build stopped: subcommand failed.
failed checks.aarch64-darwin.plugin-nix_2_34 19s
nix-grpc-store-0.1.0: ../src/build-log.hh:23:19: error: only virtual member functions can be marked 'override' 23 | void anchor() override {} | …
nix-grpc-store-0.1.0:
../src/build-log.hh:23:19: error: only virtual member functions can be marked 'override'
   23 |     void anchor() override {}
      |                   ^~~~~~~~
1 error generated.
[7/11] Compiling C++ object nix-grpc-daemon.p/meson-generated_.._nix_remote.grpc.pb.cc.o
[8/11] Compiling C++ object nix-grpc-store.dylib.p/meson-generated_.._nix_remote.grpc.pb.cc.o
[9/11] Compiling C++ object nix-grpc-store.dylib.p/src_grpc-store.cc.o
ninja: build stopped: subcommand failed.
dependency failed checks.aarch64-linux.acme-vm
failed checks.aarch64-linux.exit-stress 3m 7s
nix-expr-2.36.0pre20260901_72385de1+1: Checking for function "sysconf" : YES Run-time dependency Boost (found: container, context) found: YES 1.89.0 Run-time d …
nix-expr-2.36.0pre20260901_72385de1+1:
Checking for function "sysconf" : YES 
Run-time dependency Boost (found: container, context) found: YES 1.89.0
Run-time dependency nlohmann_json found: YES 3.12.0
Found CMake: /nix/store/wnpls15mjywq1fmgmbzqhshl8g2bhcvz-cmake-4.3.4/bin/cmake (4.3.4)
Run-time dependency sqlite3 found: NO (tried pkgconfig)
Run-time dependency sqlite found: NO (tried pkgconfig and cmake)
meson.build:56:9: ERROR: Dependency "sqlite" not found, tried pkgconfig and cmake
A full log can be found at /build/source-patched-source/src/libexpr/build/meson-logs/meson-log.txt
dependency failed checks.aarch64-linux.plugin-dispatcher
failed checks.aarch64-linux.plugin-nix_2_31 29s
nix-grpc-store-0.1.0: | ^ ../src/build-log.hh:21:7: note: forward declaration of 'class nixgrp …
nix-grpc-store-0.1.0:
      |                                                             ^
../src/build-log.hh:21:7: note: forward declaration of 'class nixgrpc::BackendError'
   21 | class BackendError final : public nix::CloneableError<BackendError, nix::Error>
      |       ^~~~~~~~~~~~
[7/11] Compiling C++ object nix-grpc-daemon.p/meson-generated_.._nix_remote.grpc.pb.cc.o
[8/11] Compiling C++ object nix-grpc-store.so.p/meson-generated_.._nix_remote.grpc.pb.cc.o
[9/11] Compiling C++ object nix-grpc-store.so.p/src_grpc-store.cc.o
ninja: build stopped: subcommand failed.
failed checks.aarch64-linux.plugin-nix_2_34 31s
nix-grpc-store-0.1.0: In file included from ../src/nix-grpc-daemon.cc:60: ../src/build-log.hh:23:10: error: 'void nixgrpc::BackendError::anchor()' marked 'overr …
nix-grpc-store-0.1.0:
In file included from ../src/nix-grpc-daemon.cc:60:
../src/build-log.hh:23:10: error: 'void nixgrpc::BackendError::anchor()' marked 'override', but does not override
   23 |     void anchor() override {}
      |          ^~~~~~
[7/11] Compiling C++ object nix-grpc-daemon.p/meson-generated_.._nix_remote.grpc.pb.cc.o
[8/11] Compiling C++ object nix-grpc-store.so.p/meson-generated_.._nix_remote.grpc.pb.cc.o
[9/11] Compiling C++ object nix-grpc-store.so.p/src_grpc-store.cc.o
ninja: build stopped: subcommand failed.
failed checks.aarch64-linux.sanitize-smoke 3m 4s
nix-expr-2.36.0pre20260901_72385de1+1: Checking for function "sysconf" : YES Run-time dependency Boost (found: container, context) found: YES 1.89.0 Run-time d …
nix-expr-2.36.0pre20260901_72385de1+1:
Checking for function "sysconf" : YES 
Run-time dependency Boost (found: container, context) found: YES 1.89.0
Run-time dependency nlohmann_json found: YES 3.12.0
Found CMake: /nix/store/wnpls15mjywq1fmgmbzqhshl8g2bhcvz-cmake-4.3.4/bin/cmake (4.3.4)
Run-time dependency sqlite3 found: NO (tried pkgconfig)
Run-time dependency sqlite found: NO (tried pkgconfig and cmake)
meson.build:56:9: ERROR: Dependency "sqlite" not found, tried pkgconfig and cmake
A full log can be found at /build/source-patched-source/src/libexpr/build/meson-logs/meson-log.txt
dependency failed checks.aarch64-linux.vm
dependency failed checks.x86_64-linux.acme-vm
failed checks.x86_64-linux.exit-stress 2m 22s
nix-expr-2.36.0pre20260901_72385de1+1: Checking for function "sysconf" : YES Run-time dependency Boost (found: container, context) found: YES 1.89.0 Run-time d …
nix-expr-2.36.0pre20260901_72385de1+1:
Checking for function "sysconf" : YES 
Run-time dependency Boost (found: container, context) found: YES 1.89.0
Run-time dependency nlohmann_json found: YES 3.12.0
Found CMake: /nix/store/908kvhj55s5z7laavf4pddxrxl62rrgl-cmake-4.3.4/bin/cmake (4.3.4)
Run-time dependency sqlite3 found: NO (tried pkgconfig)
Run-time dependency sqlite found: NO (tried pkgconfig and cmake)
meson.build:56:9: ERROR: Dependency "sqlite" not found, tried pkgconfig and cmake
A full log can be found at /build/source-patched-source/src/libexpr/build/meson-logs/meson-log.txt
dependency failed checks.x86_64-linux.plugin-dispatcher
failed checks.x86_64-linux.plugin-nix_2_31 21s
nix-grpc-store-0.1.0: | ^ ../src/build-log.hh:21:7: note: forward declaration of 'class nixgrp …
nix-grpc-store-0.1.0:
      |                                                             ^
../src/build-log.hh:21:7: note: forward declaration of 'class nixgrpc::BackendError'
   21 | class BackendError final : public nix::CloneableError<BackendError, nix::Error>
      |       ^~~~~~~~~~~~
[7/11] Compiling C++ object nix-grpc-store.so.p/meson-generated_.._nix_remote.grpc.pb.cc.o
[8/11] Compiling C++ object nix-grpc-daemon.p/meson-generated_.._nix_remote.grpc.pb.cc.o
[9/11] Compiling C++ object nix-grpc-store.so.p/src_grpc-store.cc.o
ninja: build stopped: subcommand failed.
failed checks.x86_64-linux.plugin-nix_2_34 22s
nix-grpc-store-0.1.0: In file included from ../src/nix-grpc-daemon.cc:60: ../src/build-log.hh:23:10: error: 'void nixgrpc::BackendError::anchor()' marked 'overr …
nix-grpc-store-0.1.0:
In file included from ../src/nix-grpc-daemon.cc:60:
../src/build-log.hh:23:10: error: 'void nixgrpc::BackendError::anchor()' marked 'override', but does not override
   23 |     void anchor() override {}
      |          ^~~~~~
[7/11] Compiling C++ object nix-grpc-store.so.p/meson-generated_.._nix_remote.grpc.pb.cc.o
[8/11] Compiling C++ object nix-grpc-daemon.p/meson-generated_.._nix_remote.grpc.pb.cc.o
[9/11] Compiling C++ object nix-grpc-store.so.p/src_grpc-store.cc.o
ninja: build stopped: subcommand failed.
failed checks.x86_64-linux.sanitize-smoke 2m 26s
nix-expr-2.36.0pre20260901_72385de1+1: Checking for function "sysconf" : YES Run-time dependency Boost (found: container, context) found: YES 1.89.0 Run-time d …
nix-expr-2.36.0pre20260901_72385de1+1:
Checking for function "sysconf" : YES 
Run-time dependency Boost (found: container, context) found: YES 1.89.0
Run-time dependency nlohmann_json found: YES 3.12.0
Found CMake: /nix/store/908kvhj55s5z7laavf4pddxrxl62rrgl-cmake-4.3.4/bin/cmake (4.3.4)
Run-time dependency sqlite3 found: NO (tried pkgconfig)
Run-time dependency sqlite found: NO (tried pkgconfig and cmake)
meson.build:56:9: ERROR: Dependency "sqlite" not found, tried pkgconfig and cmake
A full log can be found at /build/source-patched-source/src/libexpr/build/meson-logs/meson-log.txt
dependency failed checks.x86_64-linux.vm
8 succeeded
succeeded attributes
status attribute duration
loading…