nixbot

builds

Mic92/nix-grpc-store build #76 failed

branch main · PR #35 · commit 7d8900db67 · · took 10m 46s · eval 16s

9 failed
failed attributes
status attribute duration
failed checks.aarch64-darwin.clang-tidy 1m 14s
nix-grpc-store-clang-tidy-0.1.0: 81 | int const conn = ::accept4(pollFds.at(idx).fd, nullptr, nullptr, SOCK_CLOEXEC | SOCK_NONBLOCK); | …
nix-grpc-store-clang-tidy-0.1.0:
   81 |                 int const conn = ::accept4(pollFds.at(idx).fd, nullptr, nullptr, SOCK_CLOEXEC | SOCK_NONBLOCK);
      |                                                                                  ^~~~~~~~~~~~
../src/socket-activation.hh:81:97: error: use of undeclared identifier 'SOCK_NONBLOCK' [clang-diagnostic-error]
   81 |                 int const conn = ::accept4(pollFds.at(idx).fd, nullptr, nullptr, SOCK_CLOEXEC | SOCK_NONBLOCK);
      |                                                                                                 ^~~~~~~~~~~~~
FAILED: [code=1] meson-internal__clang-tidy 
/nix/store/735yy09gy9j1wzwrsd1v1xrgf6izyr5d-meson-1.10.2/bin/meson --internal clangtidy /nix/var/nix/builds/nix-41250-1147263943/source /nix/var/nix/builds/nix-41250-1147263943/source/build --color always
ninja: build stopped: subcommand failed.
failed checks.aarch64-darwin.exit-stress 3m 4s
nix-grpc-store-0.1.0: ../src/socket-activation.hh:81:97: error: use of undeclared identifier 'SOCK_NONBLOCK' 81 | int const conn = ::accept4( …
nix-grpc-store-0.1.0:
../src/socket-activation.hh:81:97: error: use of undeclared identifier 'SOCK_NONBLOCK'
   81 |                 int const conn = ::accept4(pollFds.at(idx).fd, nullptr, nullptr, SOCK_CLOEXEC | SOCK_NONBLOCK);
      |                                                                                                 ^~~~~~~~~~~~~
3 errors generated.
[7/11] Compiling C++ object nix-grpc-daemon.p/meson-generated_.._nix_remote.grpc.pb.cc.o
[8/11] Compiling C++ object nix-grpc-store.dylib.p/meson-generated_.._nix_remote.grpc.pb.cc.o
[9/11] Compiling C++ object nix-grpc-store.dylib.p/src_grpc-store.cc.o
ninja: build stopped: subcommand failed.
dependency failed checks.aarch64-darwin.plugin-dispatcher
failed checks.aarch64-darwin.plugin-nix_2_31 54s
nix-grpc-store-0.1.0: ../src/socket-activation.hh:81:97: error: use of undeclared identifier 'SOCK_NONBLOCK' 81 | int const conn = ::accept4( …
nix-grpc-store-0.1.0:
../src/socket-activation.hh:81:97: error: use of undeclared identifier 'SOCK_NONBLOCK'
   81 |                 int const conn = ::accept4(pollFds.at(idx).fd, nullptr, nullptr, SOCK_CLOEXEC | SOCK_NONBLOCK);
      |                                                                                                 ^~~~~~~~~~~~~
3 errors generated.
[7/11] Compiling C++ object nix-grpc-store.dylib.p/meson-generated_.._nix_remote.grpc.pb.cc.o
[8/11] Compiling C++ object nix-grpc-daemon.p/meson-generated_.._nix_remote.grpc.pb.cc.o
[9/11] Compiling C++ object nix-grpc-store.dylib.p/src_grpc-store.cc.o
ninja: build stopped: subcommand failed.
failed checks.aarch64-darwin.plugin-nix_2_34 54s
nix-grpc-store-0.1.0: ../src/socket-activation.hh:81:97: error: use of undeclared identifier 'SOCK_NONBLOCK' 81 | int const conn = ::accept4( …
nix-grpc-store-0.1.0:
../src/socket-activation.hh:81:97: error: use of undeclared identifier 'SOCK_NONBLOCK'
   81 |                 int const conn = ::accept4(pollFds.at(idx).fd, nullptr, nullptr, SOCK_CLOEXEC | SOCK_NONBLOCK);
      |                                                                                                 ^~~~~~~~~~~~~
3 errors generated.
[7/11] Compiling C++ object nix-grpc-store.dylib.p/meson-generated_.._nix_remote.grpc.pb.cc.o
[8/11] Compiling C++ object nix-grpc-daemon.p/meson-generated_.._nix_remote.grpc.pb.cc.o
[9/11] Compiling C++ object nix-grpc-store.dylib.p/src_grpc-store.cc.o
ninja: build stopped: subcommand failed.
failed checks.aarch64-darwin.plugin-nix_2_35 54s
nix-grpc-store-0.1.0: ../src/socket-activation.hh:81:97: error: use of undeclared identifier 'SOCK_NONBLOCK' 81 | int const conn = ::accept4( …
nix-grpc-store-0.1.0:
../src/socket-activation.hh:81:97: error: use of undeclared identifier 'SOCK_NONBLOCK'
   81 |                 int const conn = ::accept4(pollFds.at(idx).fd, nullptr, nullptr, SOCK_CLOEXEC | SOCK_NONBLOCK);
      |                                                                                                 ^~~~~~~~~~~~~
3 errors generated.
[7/11] Compiling C++ object nix-grpc-store.dylib.p/meson-generated_.._nix_remote.grpc.pb.cc.o
[8/11] Compiling C++ object nix-grpc-daemon.p/meson-generated_.._nix_remote.grpc.pb.cc.o
[9/11] Compiling C++ object nix-grpc-store.dylib.p/src_grpc-store.cc.o
ninja: build stopped: subcommand failed.
failed checks.aarch64-linux.acme-vm 4m 6s
vm-test-run-nix-grpc-store-acme-substituter: host1 # qemu-system-aarch64: terminating on signal 15 from pid 39 (/nix/store/lfh101cfjj8p8npcari9hk0lbqi33yvh-pyth …
vm-test-run-nix-grpc-store-acme-substituter:
host1 # qemu-system-aarch64: terminating on signal 15 from pid 39 (/nix/store/lfh101cfjj8p8npcari9hk0lbqi33yvh-python3-3.14.7/bin/python3.14)
kill QemuMachine (pid 48)
server # qemu-system-aarch64: terminating on signal 15 from pid 39 (/nix/store/lfh101cfjj8p8npcari9hk0lbqi33yvh-python3-3.14.7/bin/python3.14)
(finished: cleanup, in 0.43 seconds)
additionally exposed symbols:
    host1, server,
    vlan1,
    start_all, test_script, machines, machines_qemu, machines_nspawn, vlans, driver, log, os, create_machine, subtest, run_tests, join_all, retry, serial_stdout_off, serial_stdout_on, polling_condition, BaseMachine, QemuMachine, NspawnMachine, t, debug, dump_machine_ssh
failed checks.x86_64-linux.acme-vm 10m 29s
vm-test-run-nix-grpc-store-acme-substituter: ) ^ File "/nix/store/raq2dn1v9hnqcadzwci0xzc3ayjzpqy3-nixos-test-driver-1.1/lib/python3.14/site-packages/ …
vm-test-run-nix-grpc-store-acme-substituter:
    )
    ^
  File "/nix/store/raq2dn1v9hnqcadzwci0xzc3ayjzpqy3-nixos-test-driver-1.1/lib/python3.14/site-packages/test_driver/machine/__init__.py", line 983, in _execute
    self.connect()
    ~~~~~~~~~~~~^^
  File "/nix/store/raq2dn1v9hnqcadzwci0xzc3ayjzpqy3-nixos-test-driver-1.1/lib/python3.14/site-packages/test_driver/machine/__init__.py", line 1172, in connect
    raise RuntimeError("Shell did not start in time")
RuntimeError: Shell did not start in time
failed checks.x86_64-linux.vm 5m 2s
vm-test-run-nix-grpc-store: ) ^ File "/nix/store/raq2dn1v9hnqcadzwci0xzc3ayjzpqy3-nixos-test-driver-1.1/lib/python3.14/site-packages/test_driver/machi …
vm-test-run-nix-grpc-store:
    )
    ^
  File "/nix/store/raq2dn1v9hnqcadzwci0xzc3ayjzpqy3-nixos-test-driver-1.1/lib/python3.14/site-packages/test_driver/machine/__init__.py", line 983, in _execute
    self.connect()
    ~~~~~~~~~~~~^^
  File "/nix/store/raq2dn1v9hnqcadzwci0xzc3ayjzpqy3-nixos-test-driver-1.1/lib/python3.14/site-packages/test_driver/machine/__init__.py", line 1172, in connect
    raise RuntimeError("Shell did not start in time")
RuntimeError: Shell did not start in time
13 succeeded
succeeded attributes
status attribute duration
loading…
4 already built
skipped attributes
status attribute duration
loading…