nixbot

builds

Mic92/nix-grpc-store build #77 failed

branch main · PR #35 · commit 344c9831a5 · · took 2m 6s · eval 15s

8 failed
failed attributes
status attribute duration
failed checks.aarch64-darwin.clang-tidy 36s
nix-grpc-store-clang-tidy-0.1.0: 51 | int const conn = ::accept4(listenFd, nullptr, nullptr, SOCK_CLOEXEC | SOCK_NONBLOCK); | …
nix-grpc-store-clang-tidy-0.1.0:
   51 |                 int const conn = ::accept4(listenFd, nullptr, nullptr, SOCK_CLOEXEC | SOCK_NONBLOCK);
      |                                                                        ^~~~~~~~~~~~
../src/socket-activation.hh:51:87: error: use of undeclared identifier 'SOCK_NONBLOCK' [clang-diagnostic-error]
   51 |                 int const conn = ::accept4(listenFd, nullptr, nullptr, SOCK_CLOEXEC | SOCK_NONBLOCK);
      |                                                                                       ^~~~~~~~~~~~~
FAILED: [code=1] meson-internal__clang-tidy 
/nix/store/735yy09gy9j1wzwrsd1v1xrgf6izyr5d-meson-1.10.2/bin/meson --internal clangtidy /nix/var/nix/builds/nix-91402-1422598138/source /nix/var/nix/builds/nix-91402-1422598138/source/build --color always
ninja: build stopped: subcommand failed.
failed checks.aarch64-darwin.exit-stress 22s
nix-grpc-store-0.1.0: ../src/socket-activation.hh:51:87: error: use of undeclared identifier 'SOCK_NONBLOCK' 51 | int const conn = ::accept4( …
nix-grpc-store-0.1.0:
../src/socket-activation.hh:51:87: error: use of undeclared identifier 'SOCK_NONBLOCK'
   51 |                 int const conn = ::accept4(listenFd, nullptr, nullptr, SOCK_CLOEXEC | SOCK_NONBLOCK);
      |                                                                                       ^~~~~~~~~~~~~
3 errors generated.
[7/11] Compiling C++ object nix-grpc-daemon.p/meson-generated_.._nix_remote.grpc.pb.cc.o
[8/11] Compiling C++ object nix-grpc-store.dylib.p/meson-generated_.._nix_remote.grpc.pb.cc.o
[9/11] Compiling C++ object nix-grpc-store.dylib.p/src_grpc-store.cc.o
ninja: build stopped: subcommand failed.
dependency failed checks.aarch64-darwin.plugin-dispatcher
failed checks.aarch64-darwin.plugin-nix_2_31 21s
nix-grpc-store-0.1.0: ../src/socket-activation.hh:51:87: error: use of undeclared identifier 'SOCK_NONBLOCK' 51 | int const conn = ::accept4( …
nix-grpc-store-0.1.0:
../src/socket-activation.hh:51:87: error: use of undeclared identifier 'SOCK_NONBLOCK'
   51 |                 int const conn = ::accept4(listenFd, nullptr, nullptr, SOCK_CLOEXEC | SOCK_NONBLOCK);
      |                                                                                       ^~~~~~~~~~~~~
3 errors generated.
[7/11] Compiling C++ object nix-grpc-store.dylib.p/meson-generated_.._nix_remote.grpc.pb.cc.o
[8/11] Compiling C++ object nix-grpc-daemon.p/meson-generated_.._nix_remote.grpc.pb.cc.o
[9/11] Compiling C++ object nix-grpc-store.dylib.p/src_grpc-store.cc.o
ninja: build stopped: subcommand failed.
failed checks.aarch64-darwin.plugin-nix_2_34 21s
nix-grpc-store-0.1.0: ../src/socket-activation.hh:51:87: error: use of undeclared identifier 'SOCK_NONBLOCK' 51 | int const conn = ::accept4( …
nix-grpc-store-0.1.0:
../src/socket-activation.hh:51:87: error: use of undeclared identifier 'SOCK_NONBLOCK'
   51 |                 int const conn = ::accept4(listenFd, nullptr, nullptr, SOCK_CLOEXEC | SOCK_NONBLOCK);
      |                                                                                       ^~~~~~~~~~~~~
3 errors generated.
[7/11] Compiling C++ object nix-grpc-daemon.p/meson-generated_.._nix_remote.grpc.pb.cc.o
[8/11] Compiling C++ object nix-grpc-store.dylib.p/meson-generated_.._nix_remote.grpc.pb.cc.o
[9/11] Compiling C++ object nix-grpc-store.dylib.p/src_grpc-store.cc.o
ninja: build stopped: subcommand failed.
failed checks.aarch64-darwin.plugin-nix_2_35 22s
nix-grpc-store-0.1.0: ../src/socket-activation.hh:51:87: error: use of undeclared identifier 'SOCK_NONBLOCK' 51 | int const conn = ::accept4( …
nix-grpc-store-0.1.0:
../src/socket-activation.hh:51:87: error: use of undeclared identifier 'SOCK_NONBLOCK'
   51 |                 int const conn = ::accept4(listenFd, nullptr, nullptr, SOCK_CLOEXEC | SOCK_NONBLOCK);
      |                                                                                       ^~~~~~~~~~~~~
3 errors generated.
[7/11] Compiling C++ object nix-grpc-daemon.p/meson-generated_.._nix_remote.grpc.pb.cc.o
[8/11] Compiling C++ object nix-grpc-store.dylib.p/meson-generated_.._nix_remote.grpc.pb.cc.o
[9/11] Compiling C++ object nix-grpc-store.dylib.p/src_grpc-store.cc.o
ninja: build stopped: subcommand failed.
failed checks.aarch64-linux.acme-vm 1m 5s
vm-test-run-nix-grpc-store-acme-substituter: host1 # qemu-system-aarch64: terminating on signal 15 from pid 39 (/nix/store/lfh101cfjj8p8npcari9hk0lbqi33yvh-pyth …
vm-test-run-nix-grpc-store-acme-substituter:
host1 # qemu-system-aarch64: terminating on signal 15 from pid 39 (/nix/store/lfh101cfjj8p8npcari9hk0lbqi33yvh-python3-3.14.7/bin/python3.14)
kill QemuMachine (pid 48)
server # qemu-system-aarch64: terminating on signal 15 from pid 39 (/nix/store/lfh101cfjj8p8npcari9hk0lbqi33yvh-python3-3.14.7/bin/python3.14)
(finished: cleanup, in 0.42 seconds)
additionally exposed symbols:
    host1, server,
    vlan1,
    start_all, test_script, machines, machines_qemu, machines_nspawn, vlans, driver, log, os, create_machine, subtest, run_tests, join_all, retry, serial_stdout_off, serial_stdout_on, polling_condition, BaseMachine, QemuMachine, NspawnMachine, t, debug, dump_machine_ssh
failed checks.x86_64-linux.acme-vm 1m 7s
vm-test-run-nix-grpc-store-acme-substituter: host1 # qemu-system-x86_64: terminating on signal 15 from pid 39 (/nix/store/b5bpi6zfajzzrwwpgba2q6li3nnya4bs-pytho …
vm-test-run-nix-grpc-store-acme-substituter:
host1 # qemu-system-x86_64: terminating on signal 15 from pid 39 (/nix/store/b5bpi6zfajzzrwwpgba2q6li3nnya4bs-python3-3.14.7/bin/python3.14)
kill QemuMachine (pid 48)
server # qemu-system-x86_64: terminating on signal 15 from pid 39 (/nix/store/b5bpi6zfajzzrwwpgba2q6li3nnya4bs-python3-3.14.7/bin/python3.14)
(finished: cleanup, in 0.36 seconds)
additionally exposed symbols:
    host1, server,
    vlan1,
    start_all, test_script, machines, machines_qemu, machines_nspawn, vlans, driver, log, os, create_machine, subtest, run_tests, join_all, retry, serial_stdout_off, serial_stdout_on, polling_condition, BaseMachine, QemuMachine, NspawnMachine, t, debug, dump_machine_ssh
12 succeeded
succeeded attributes
status attribute duration
loading…
6 already built
skipped attributes
status attribute duration
loading…