setup
checks.aarch64-darwin.nixbot-tests
· build #392
· raw
1this derivation will be built:2 /nix/store/jxbxh0yl7cp6jxgybn377m7zaw4g9q44-python3.14-nixbot-tests.drv3error: build of '/nix/store/jxbxh0yl7cp6jxgybn377m7zaw4g9q44-python3.14-nixbot-tests.drv' on 'ssh-ng://customer@mac02' failed: Cannot build '/nix/store/jxbxh0yl7cp6jxgybn377m7zaw4g9q44-python3.14-nixbot-tests.drv'.4 Reason: builder failed with exit code 1.5 Output paths:6 /nix/store/12w85hnighwkbpbg6dm0j62xpsgb2yxb-python3.14-nixbot-tests7 /nix/store/vy4pi8mip3a46f3n0381z26jd03zqadx-python3.14-nixbot-tests-dist8 Last 25 log lines:9 > ChangeEvent(repo=project, branch="main", commit_sha=sha)10 > )11 > )12 > await eval_runner.started.wait()13 > build2 = await orchestrator.handle_change_event(14 > ChangeEvent(repo=project, branch="main", commit_sha=sha, pr_number=4)15 > )16 > assert build2 is not None17 > orchestrator.cancel_events[build2.id_].set()18 > await task119 > cancelled_evals = [e for e in reporter.events if e[0] == "eval-cancelled"]20 > assert len(cancelled_evals) == 221 > finished = [e for e in reporter.events if e[0] == "finished"]22 > > assert len(finished) == 223 > E AssertionError: assert 1 == 224 > E + where 1 = len([('finished', 69, 'cancelled', 0)])25 >26 > nixbot/tests/test_orchestrator.py:2403: AssertionError27 > ------------------------------ Captured log call -------------------------------28 > WARNING nixbot.memory:memory.py:99 could not read memory info, using conservative estimates29 > =========================== short test summary info ============================30 > FAILED nixbot/tests/test_orchestrator.py::test_inflight_share_fans_out_final_status - AssertionError: assert 1 == 231 > FAILED nixbot/tests/test_orchestrator.py::test_linked_context_reported_on_eval_failure - AssertionError: assert 1 == 232 > FAILED nixbot/tests/test_orchestrator.py::test_cancel_during_eval_resolves_linked_eval_contexts - AssertionError: assert 1 == 233 > ================== 3 failed, 814 passed, 28 skipped in 27.87s ==================34 For full logs, run:35 nix log /nix/store/jxbxh0yl7cp6jxgybn377m7zaw4g9q44-python3.14-nixbot-tests.drv36error: Cannot build '/nix/store/jxbxh0yl7cp6jxgybn377m7zaw4g9q44-python3.14-nixbot-tests.drv'.37 Reason: builder failed with exit code 1.38 Output paths:39 /nix/store/12w85hnighwkbpbg6dm0j62xpsgb2yxb-python3.14-nixbot-tests40 /nix/store/vy4pi8mip3a46f3n0381z26jd03zqadx-python3.14-nixbot-tests-dist