setup
checks.x86_64-linux.nixbot-tests
· build #392
· raw
1this derivation will be built:2 /nix/store/zs71s7p6lyxacb4hi36vxdl9r01sdy4b-python3.14-nixbot-tests.drv3error: Cannot build '/nix/store/zs71s7p6lyxacb4hi36vxdl9r01sdy4b-python3.14-nixbot-tests.drv'.4 Reason: builder failed with exit code 1.5 Output paths:6 /nix/store/0fvqq631gddm7v8qwr2nbcqqzpvl3hc9-python3.14-nixbot-tests-dist7 /nix/store/vq1da4x3rzvj9rzw2vprzc4wqh2xy2sp-python3.14-nixbot-tests8 Last 25 log lines:9 > task1 = asyncio.create_task(10 > orchestrator.handle_change_event(11 > ChangeEvent(repo=project, branch="main", commit_sha=sha)12 > )13 > )14 > await eval_runner.started.wait()15 > build2 = await orchestrator.handle_change_event(16 > ChangeEvent(repo=project, branch="main", commit_sha=sha, pr_number=4)17 > )18 > assert build2 is not None19 > orchestrator.cancel_events[build2.id_].set()20 > await task121 > cancelled_evals = [e for e in reporter.events if e[0] == "eval-cancelled"]22 > assert len(cancelled_evals) == 223 > finished = [e for e in reporter.events if e[0] == "finished"]24 > > assert len(finished) == 225 > E AssertionError: assert 1 == 226 > E + where 1 = len([('finished', 69, 'cancelled', 0)])27 >28 > nixbot/tests/test_orchestrator.py:2403: AssertionError29 > =========================== short test summary info ============================30 > FAILED nixbot/tests/test_orchestrator.py::test_inflight_share_fans_out_final_status31 > FAILED nixbot/tests/test_orchestrator.py::test_linked_context_reported_on_eval_failure32 > FAILED nixbot/tests/test_orchestrator.py::test_cancel_during_eval_resolves_linked_eval_contexts33 > ================== 3 failed, 830 passed, 12 skipped in 25.22s ==================34 For full logs, run:35 nix log /nix/store/zs71s7p6lyxacb4hi36vxdl9r01sdy4b-python3.14-nixbot-tests.drv