failed attributes
| status |
attribute |
duration |
| failed |
checks.aarch64-darwin.tincd-test
|
1m 31s |
tincd-test-0.1.0:
---- argv::help_commands_aligned stdout ----
thread 'argv::help_commands_aligned' (66788525) panicked at crates/tinc-tools/tests/tinc_cli/argv …
tincd-test-0.1.0:
---- argv::help_commands_aligned stdout ----
thread 'argv::help_commands_aligned' (66788525) panicked at crates/tinc-tools/tests/tinc_cli/argv.rs:94:36:
no column separator in " join [--identity-only [--output-key FILE]] INVITATION"
note: run with `RUST_BACKTRACE=1` environment variable to display a backtrace
failures:
argv::help_commands_aligned
test result: FAILED. 70 passed; 1 failed; 0 ignored; 0 measured; 0 filtered out; finished in 0.27s
error: test failed, to rerun pass `-p tinc-tools --test tinc_cli`
|
| failed |
checks.aarch64-linux.tincd-test
|
1m 18s |
tincd-test-0.1.0:
---- argv::help_commands_aligned stdout ----
thread 'argv::help_commands_aligned' (9515) panicked at crates/tinc-tools/tests/tinc_cli/argv.rs: …
tincd-test-0.1.0:
---- argv::help_commands_aligned stdout ----
thread 'argv::help_commands_aligned' (9515) panicked at crates/tinc-tools/tests/tinc_cli/argv.rs:94:36:
no column separator in " join [--identity-only [--output-key FILE]] INVITATION"
note: run with `RUST_BACKTRACE=1` environment variable to display a backtrace
failures:
argv::help_commands_aligned
test result: FAILED. 70 passed; 1 failed; 0 ignored; 0 measured; 0 filtered out; finished in 0.12s
error: test failed, to rerun pass `-p tinc-tools --test tinc_cli`
|
| failed |
checks.x86_64-linux.tincd-test
|
1m 2s |
tincd-test-0.1.0:
---- argv::help_commands_aligned stdout ----
thread 'argv::help_commands_aligned' (9417) panicked at crates/tinc-tools/tests/tinc_cli/argv.rs: …
tincd-test-0.1.0:
---- argv::help_commands_aligned stdout ----
thread 'argv::help_commands_aligned' (9417) panicked at crates/tinc-tools/tests/tinc_cli/argv.rs:94:36:
no column separator in " join [--identity-only [--output-key FILE]] INVITATION"
note: run with `RUST_BACKTRACE=1` environment variable to display a backtrace
failures:
argv::help_commands_aligned
test result: FAILED. 70 passed; 1 failed; 0 ignored; 0 measured; 0 filtered out; finished in 0.17s
error: test failed, to rerun pass `-p tinc-tools --test tinc_cli`
|