nixbot

builds

Mic92/tincr build #101 failed

branch hosts-overlay · PR #67 · commit 78462c2704 · · took 5m 47s · eval 54s

5 failed
failed attributes
status attribute duration
failed checks.aarch64-darwin.tincd-test 1m 27s
tincd-test-0.1.0: ---- argv::help_commands_aligned stdout ---- thread 'argv::help_commands_aligned' (66807747) panicked at crates/tinc-tools/tests/tinc_cli/argv …
tincd-test-0.1.0:
---- argv::help_commands_aligned stdout ----
thread 'argv::help_commands_aligned' (66807747) panicked at crates/tinc-tools/tests/tinc_cli/argv.rs:94:36:
no column separator in "  join [--identity-only[=FILE]] INVITATION"
note: run with `RUST_BACKTRACE=1` environment variable to display a backtrace
failures:
    argv::help_commands_aligned
test result: FAILED. 70 passed; 1 failed; 0 ignored; 0 measured; 0 filtered out; finished in 0.28s
error: test failed, to rerun pass `-p tinc-tools --test tinc_cli`
failed checks.aarch64-linux.tincd-test 1m 29s
tincd-test-0.1.0: ---- argv::help_commands_aligned stdout ---- thread 'argv::help_commands_aligned' (9515) panicked at crates/tinc-tools/tests/tinc_cli/argv.rs: …
tincd-test-0.1.0:
---- argv::help_commands_aligned stdout ----
thread 'argv::help_commands_aligned' (9515) panicked at crates/tinc-tools/tests/tinc_cli/argv.rs:94:36:
no column separator in "  join [--identity-only[=FILE]] INVITATION"
note: run with `RUST_BACKTRACE=1` environment variable to display a backtrace
failures:
    argv::help_commands_aligned
test result: FAILED. 70 passed; 1 failed; 0 ignored; 0 measured; 0 filtered out; finished in 0.25s
error: test failed, to rerun pass `-p tinc-tools --test tinc_cli`
failed checks.x86_64-linux.android-mesh 5m 7s
android-mesh-check: [DEBUG tincd] Sandbox is disabled == logcat == appops: ACTIVATE_VPN: allow; time=+30s191ms ago prepared: true at io.thalheim.tincr.MeshTes …
android-mesh-check:
[DEBUG tincd] Sandbox is disabled
== logcat ==
appops: ACTIVATE_VPN: allow; time=+30s191ms ago
 prepared: true
	at io.thalheim.tincr.MeshTest.poll(MeshTest.kt:61)
	at io.thalheim.tincr.MeshTest.meshComesUp(MeshTest.kt:85)
FAILURES!!!
Tests run: 1,  Failures: 1
failed checks.x86_64-linux.nixos-tinc-auth-container 36s
unit-tinc-auth.service: tribuchet: building on jamie tribuchet worker error: connecting to the build agent at /run/tribuchet/agents/83.sock: Connection refused …
unit-tinc-auth.service:
tribuchet: building on jamie
tribuchet worker error: connecting to the build agent at /run/tribuchet/agents/83.sock: Connection refused (os error 111)
failed checks.x86_64-linux.tincd-test 1m 3s
tincd-test-0.1.0: ---- argv::help_commands_aligned stdout ---- thread 'argv::help_commands_aligned' (9417) panicked at crates/tinc-tools/tests/tinc_cli/argv.rs: …
tincd-test-0.1.0:
---- argv::help_commands_aligned stdout ----
thread 'argv::help_commands_aligned' (9417) panicked at crates/tinc-tools/tests/tinc_cli/argv.rs:94:36:
no column separator in "  join [--identity-only[=FILE]] INVITATION"
note: run with `RUST_BACKTRACE=1` environment variable to display a backtrace
failures:
    argv::help_commands_aligned
test result: FAILED. 70 passed; 1 failed; 0 ignored; 0 measured; 0 filtered out; finished in 0.17s
error: test failed, to rerun pass `-p tinc-tools --test tinc_cli`
27 succeeded
succeeded attributes
status attribute duration
loading…