tincd-test-0.1.0
checks.aarch64-darwin.tincd-test
· build #100
· raw
unpackPhase
1unpacking source archive /nix/store/3vpn7nbykb15gf0s0dmxbm1p56rb81mr-source2source root is sourcepatchPhase
3Executing configureCargoCommonVars4decompressing cargo artifacts from /nix/store/kg5y6n3rqgvz9pw6b2llqvk8lgcvi0d0-tincd-deps-0.1.0/target.tar.zst to targetconfigurePhase
5will append /nix/var/nix/builds/nix-96119-347051312/source/.cargo-home/config.toml with contents of /nix/store/2x2mj6yy4jxkr87ik16w9p9rjr1ak9j7-vendor-cargo-deps/config.toml6default configurePhase, nothing to dobuildPhase
7+++ command cargo --version8cargo 1.97.0 (c980f4866 2026-06-30)checkPhase
9+++ command cargo test --release --workspace10 Compiling num-traits v0.2.1911 Compiling rustix v1.1.412 Compiling errno v0.3.1413 Compiling once_cell v1.21.414 Compiling fastrand v2.4.015 Compiling zerocopy v0.8.5616 Compiling tinc-proto v0.0.0 (/nix/var/nix/builds/nix-96119-347051312/source/crates/tinc-proto)17 Compiling tinc-device v0.0.0 (/nix/var/nix/builds/nix-96119-347051312/source/crates/tinc-device)18 Compiling tincd v0.1.0 (/nix/var/nix/builds/nix-96119-347051312/source/crates/tincd)19 Compiling getrandom v0.3.420 Compiling wait-timeout v0.2.121 Compiling quick-error v1.2.322 Compiling fnv v1.0.723 Compiling bit-vec v0.8.024 Compiling unarray v0.1.425 Compiling regex-syntax v0.8.1126 Compiling generic-array v0.14.727 Compiling bit-set v0.8.028 Compiling tinc-ffi v0.0.0 (/nix/var/nix/builds/nix-96119-347051312/source/crates/tinc-ffi)29 Compiling hex v0.4.330 Compiling rand_core v0.9.531 Compiling rand v0.9.232 Compiling rand_xorshift v0.4.033warning: tincd@0.1.0: Warning: supplying the --target arm64-apple-macosx != arm64-apple-darwin argument to a nix-wrapped compiler may not work correctly - cc-wrapper is currently not designed with multi-target compilers in mind. You may want to use an un-wrapped compiler instead.34 Compiling module-lattice v0.2.335 Compiling crypto-bigint v0.7.536 Compiling inout v0.1.437 Compiling ml-kem v0.3.238 Compiling crypto-common v0.1.739 Compiling cipher v0.4.440 Compiling chacha20 v0.9.141 Compiling tempfile v3.27.042 Compiling rusty-fork v0.3.143warning: tinc-ffi@0.0.0: Warning: supplying the --target arm64-apple-macosx != arm64-apple-darwin argument to a nix-wrapped compiler may not work correctly - cc-wrapper is currently not designed with multi-target compilers in mind. You may want to use an un-wrapped compiler instead.44warning: tinc-ffi@0.0.0: Warning: supplying the --target arm64-apple-macosx != arm64-apple-darwin argument to a nix-wrapped compiler may not work correctly - cc-wrapper is currently not designed with multi-target compilers in mind. You may want to use an un-wrapped compiler instead.45warning: tinc-ffi@0.0.0: Warning: supplying the --target arm64-apple-macosx != arm64-apple-darwin argument to a nix-wrapped compiler may not work correctly - cc-wrapper is currently not designed with multi-target compilers in mind. You may want to use an un-wrapped compiler instead.46warning: tinc-ffi@0.0.0: Warning: supplying the --target arm64-apple-macosx != arm64-apple-darwin argument to a nix-wrapped compiler may not work correctly - cc-wrapper is currently not designed with multi-target compilers in mind. You may want to use an un-wrapped compiler instead.47warning: tinc-ffi@0.0.0: Warning: supplying the --target arm64-apple-macosx != arm64-apple-darwin argument to a nix-wrapped compiler may not work correctly - cc-wrapper is currently not designed with multi-target compilers in mind. You may want to use an un-wrapped compiler instead.48warning: tinc-ffi@0.0.0: Warning: supplying the --target arm64-apple-macosx != arm64-apple-darwin argument to a nix-wrapped compiler may not work correctly - cc-wrapper is currently not designed with multi-target compilers in mind. You may want to use an un-wrapped compiler instead.49warning: tinc-ffi@0.0.0: Warning: supplying the --target arm64-apple-macosx != arm64-apple-darwin argument to a nix-wrapped compiler may not work correctly - cc-wrapper is currently not designed with multi-target compilers in mind. You may want to use an un-wrapped compiler instead.50warning: tinc-ffi@0.0.0: Warning: supplying the --target arm64-apple-macosx != arm64-apple-darwin argument to a nix-wrapped compiler may not work correctly - cc-wrapper is currently not designed with multi-target compilers in mind. You may want to use an un-wrapped compiler instead.51warning: tinc-ffi@0.0.0: Warning: supplying the --target arm64-apple-macosx != arm64-apple-darwin argument to a nix-wrapped compiler may not work correctly - cc-wrapper is currently not designed with multi-target compilers in mind. You may want to use an un-wrapped compiler instead.52warning: tinc-ffi@0.0.0: Warning: supplying the --target arm64-apple-macosx != arm64-apple-darwin argument to a nix-wrapped compiler may not work correctly - cc-wrapper is currently not designed with multi-target compilers in mind. You may want to use an un-wrapped compiler instead.53warning: tinc-ffi@0.0.0: Warning: supplying the --target arm64-apple-macosx != arm64-apple-darwin argument to a nix-wrapped compiler may not work correctly - cc-wrapper is currently not designed with multi-target compilers in mind. You may want to use an un-wrapped compiler instead.54warning: tinc-ffi@0.0.0: Warning: supplying the --target arm64-apple-macosx != arm64-apple-darwin argument to a nix-wrapped compiler may not work correctly - cc-wrapper is currently not designed with multi-target compilers in mind. You may want to use an un-wrapped compiler instead.55warning: tinc-ffi@0.0.0: Warning: supplying the --target arm64-apple-macosx != arm64-apple-darwin argument to a nix-wrapped compiler may not work correctly - cc-wrapper is currently not designed with multi-target compilers in mind. You may want to use an un-wrapped compiler instead.56warning: tinc-ffi@0.0.0: Warning: supplying the --target arm64-apple-macosx != arm64-apple-darwin argument to a nix-wrapped compiler may not work correctly - cc-wrapper is currently not designed with multi-target compilers in mind. You may want to use an un-wrapped compiler instead.57warning: tinc-ffi@0.0.0: Warning: supplying the --target arm64-apple-macosx != arm64-apple-darwin argument to a nix-wrapped compiler may not work correctly - cc-wrapper is currently not designed with multi-target compilers in mind. You may want to use an un-wrapped compiler instead.58warning: tinc-ffi@0.0.0: Warning: supplying the --target arm64-apple-macosx != arm64-apple-darwin argument to a nix-wrapped compiler may not work correctly - cc-wrapper is currently not designed with multi-target compilers in mind. You may want to use an un-wrapped compiler instead.59 Compiling tinc-crypto v0.0.0 (/nix/var/nix/builds/nix-96119-347051312/source/crates/tinc-crypto)60 Compiling tinc-sptps v0.0.0 (/nix/var/nix/builds/nix-96119-347051312/source/crates/tinc-sptps)61 Compiling tinc-conf v0.0.0 (/nix/var/nix/builds/nix-96119-347051312/source/crates/tinc-conf)62 Compiling crypto-primes v0.7.263 Compiling ppv-lite86 v0.2.2164 Compiling rand_chacha v0.10.065 Compiling rsa v0.10.0-rc.1866 Compiling tinc-tools v0.0.0 (/nix/var/nix/builds/nix-96119-347051312/source/crates/tinc-tools)67 Compiling rand_chacha v0.9.068 Compiling proptest v1.11.069 Finished `release` profile [optimized] target(s) in 1m 11s70 Running unittests src/lib.rs (target/release/deps/tinc_conf-8af079b4ba6d94f2)7172running 62 tests73test name::tests::empty_after_truncate_errors ... ok74test name::tests::envvar_same_semantics_as_host ... ok75test name::tests::host_env_beats_gethostname ... ok76test name::tests::literal_not_squashed ... ok77test name::tests::host_truncates_at_dot_and_squashes ... ok78test hostdirs::tests::no_overlay_is_plain_hosts ... ok79test name::tests::underscore_preserved ... ok80test parse::tests::entry_bool ... ok81test parse::tests::entry_int ... ok82test parse::tests::file_bom_stripped ... ok83test parse::tests::file_comments_and_blanks ... ok84test parse::tests::file_crlf ... ok85test parse::tests::file_non_utf8_tolerated ... ok86test parse::tests::file_pem_unterminated ... ok87test parse::tests::file_skips_pem ... ok88test parse::tests::line_blank_skips ... ok89test hostdirs::tests::names_overlay_missing_vs_unreadable ... ok90test parse::tests::line_empty_value_errors ... ok91test parse::tests::line_empty_variable_passes ... ok92test parse::tests::line_equals_terminates_variable ... ok93test parse::tests::line_separator_forms ... ok94test parse::tests::line_trailing_strip ... ok95test parse::tests::line_value_with_spaces ... ok96test parse::tests::lookup_case_insensitive ... ok97test parse::tests::lookup_cmdline_first ... ok98test parse::tests::lookup_file_tiebreak ... ok99test hostdirs::tests::dangling_symlink_occupies_name ... ok100test parse::tests::lookup_line_before_file ... ok101test parse::tests::lookup_multi_ordered_by_line ... ok102test hostdirs::tests::overlay_equal_to_primary_is_ignored ... ok103test hostdirs::tests::primary_shadows_overlay ... ok104test parse::tests::server_no_tincconf ... ok105test pem::tests::read_bad_b64 ... ok106test pem::tests::public_key_file_shape ... ok107test parse::tests::server_confd_empty ... ok108test pem::tests::read_crlf ... ok109test parse::tests::server_confd_is_file ... ok110test parse::tests::server_no_confd ... ok111test pem::tests::read_empty_body_line ... ok112test pem::tests::read_end_type_unchecked ... ok113test pem::tests::read_ignores_chunking ... ok114test pem::tests::read_not_found ... ok115test pem::tests::read_size_long ... ok116test pem::tests::read_size_short ... ok117test pem::tests::read_skips_preamble ... ok118test pem::tests::read_type_prefix ... ok119test pem::tests::roundtrip_sizes ... ok120test parse::tests::server_confd_head_bug_not_ported ... ok121test pem::tests::write_chunking ... ok122test pem::tests::write_chunking_uneven ... ok123test vars::tests::every_entry_is_server_or_host ... ok124test vars::tests::flags_contains ... ok125test vars::tests::lookup_case_insensitive ... ok126test pem::tests::signing_key_roundtrip ... ok127test vars::tests::lookup_unknown ... ok128test vars::tests::no_duplicate_names ... ok129test parse::tests::server_confd_one_bad ... ok130test vars::tests::safe_not_obsolete ... ok131test vars::tests::spot_check ... ok132test vars::tests::unsafe_paths_not_safe ... ok133test parse::tests::server_confd_filter ... ok134test parse::tests::server_confd_merged ... ok135136test result: ok. 62 passed; 0 failed; 0 ignored; 0 measured; 0 filtered out; finished in 0.01s137138 Running tests/roundtrip.rs (target/release/deps/roundtrip-5875fc12309fe921)139140running 3 tests141test pem_roundtrip ... ok142test line_roundtrip ... ok143test pem_skips_preamble ... ok144145test result: ok. 3 passed; 0 failed; 0 ignored; 0 measured; 0 filtered out; finished in 0.02s146147 Running unittests src/lib.rs (target/release/deps/tinc_crypto-0aef1adf41afbdfc)148149running 12 tests150test aead::tests::config_str_roundtrip ... ok151test aead::tests::default_label_suffix_empty ... ok152test invite::tests::cookie_affects_filename ... ok153test invite::tests::key_affects_slug_prefix_only ... ok154test invite::tests::filename_from_cookie ... ok155test invite::tests::key_hash_via_fingerprint ... ok156test invite::tests::parse_bad_alphabet ... ok157test invite::tests::parse_multibyte_no_panic ... ok158test invite::tests::parse_short ... ok159test hybrid::tests::mlkem768_round_trip ... ok160test invite::tests::slug_roundtrip ... ok161test aead::tests::aes_open_into_err_leaves_out_unchanged ... ok162163test result: ok. 12 passed; 0 failed; 0 ignored; 0 measured; 0 filtered out; finished in 0.00s164165 Running tests/kat.rs (target/release/deps/kat-5d1e883f980a82e8)166167running 9 tests168test b64_decode_accepts_mixed_alphabet ... ok169test b64_encode_matches_c ... ok170test invitation_crypto_kernel_matches_c ... ok171test prf_matches_c ... ok172test sign_matches_c ... ok173test ecdh_from_seed_matches_c ... ok174test chapoly_open_rejects_tampered ... ok175test aes256gcm_known_answer ... ok176test chapoly_seal_matches_c ... ok177178test result: ok. 9 passed; 0 failed; 0 ignored; 0 measured; 0 filtered out; finished in 0.01s179180 Running unittests src/lib.rs (target/release/deps/tinc_device-a38fd9511d7d4cb0)181182running 54 tests183test arena::tests::arena_is_page_aligned ... ok184test arena::tests::slot_accessors ... ok185test arena::tests::slots_within_contiguous ... ok186test arena::tests::set_len_rejects_overflow - should panic ... ok187test arena::tests::slot_oob_panics - should panic ... ok188test bsd::tests::nibble_then_prefix_roundtrip ... ok189test bsd::macos_x::tests::flush_replays_partial_tail ... ok190test bsd::macos_x::tests::flush_replays_zero_progress_once ... ok191test bsd::tests::prefix_ipv4_is_af_inet_be ... ok192test bsd::tests::prefix_ipv6_is_libc_af_inet6_be ... ok193test bsd::tests::prefix_unknown ... ok194test bsd::tests::tap_read_ether_via_seqpacket ... ok195test bsd::tests::read_unknown_nibble_errors ... ok196test bsd::tests::tap_write_ether_via_seqpacket ... ok197test bsd::tests::tun_read_ipv4_via_pipe ... ok198test bsd::tests::tun_utun_write_short_buf_errors ... ok199test bsd::tests::tun_write_strips_ether ... ok200test bsd::tests::utun_read_ignores_prefix ... ok201test bsd::tests::utun_read_runt_errors ... ok202test bsd::tests::utun_write_synthesizes_ipv6_prefix ... ok203test bsd::tests::utun_write_synthesizes_prefix ... ok204test bsd::tests::utun_write_unknown_ethertype_errors ... ok205test ether::tests::nibble_cases ... ok206test ether::tests::set_etherheader_cases ... ok207test fd::tests::read_eof_via_pipe ... ok208test fd::tests::read_ip_via_pipe ... ok209test fd::tests::read_unknown_version_via_pipe ... ok210test fd::tests::scm_rights_round_trip ... ok211test fd::tests::write_strips_ether_via_pipe ... ok212test tests::drain_clamps_cap_to_arena ... ok213test tests::drain_dummy_is_empty ... ok214test tests::drain_frames_until_eagain ... ok215test tests::drain_immediate_eagain_is_empty ... ok216test tests::drain_propagates_real_error ... ok217test tests::drain_respects_cap ... ok218test tso::tests::checksum_chains ... ok219test tso::tests::checksum_odd_tail ... ok220test tso::tests::checksum_rfc1071_reference ... ok221test tso::tests::gro_coalesce_three_v4 ... ok222test tso::tests::gro_flush_on_mismatch ... ok223test tso::tests::gro_psh_terminates ... ok224test tso::tests::gro_hits_64k_cap ... ok225test tso::tests::gro_reassembles_tso_split_output ... ok226test tso::tests::gro_rejects ... ok227test tso::tests::gro_short_tail_terminates ... ok228test tso::tests::gro_single_packet_zero_vnet_hdr ... ok229test tso::tests::gso_none_completes_partial_csum ... ok230test tso::tests::split_errors ... ok231test tso::tests::split_seq_wraps ... ok232test tso::tests::split_v4_even ... ok233test tso::tests::split_v4_short_tail ... ok234test tso::tests::split_v4_single_chunk ... ok235test tso::tests::split_v6_even ... ok236test tso::tests::vnet_hdr_decode ... ok237238test result: ok. 54 passed; 0 failed; 0 ignored; 0 measured; 0 filtered out; finished in 0.00s239240 Running tests/mq.rs (target/release/deps/mq-9202c55ca9505237)241242running 0 tests243244test result: ok. 0 passed; 0 failed; 0 ignored; 0 measured; 0 filtered out; finished in 0.00s245246 Running tests/utun_batch.rs (target/release/deps/utun_batch-fc2bb73f866b5765)247248running 3 tests249test utun_partial_drain_refires_kqueue ... ok250test utun_sendmsg_x_inject ... ok251test utun_recvmsg_x_drain ... ok252253test result: ok. 3 passed; 0 failed; 0 ignored; 0 measured; 0 filtered out; finished in 0.00s254255 Running unittests src/lib.rs (target/release/deps/tinc_ffi-e057d5b4ede8b5d5)256257running 0 tests258259test result: ok. 0 passed; 0 failed; 0 ignored; 0 measured; 0 filtered out; finished in 0.00s260261 Running tests/handshake.rs (target/release/deps/handshake-09d8538f10d116b4)262263running 6 tests264test datagram_handshake ... ok265test same_seeds_same_bytes ... ok266test stream_handshake ... ok267test stream_handshake_bytewise ... ok268test stream_rekey_uses_ack_state ... ok269test wrong_peer_key_fails_at_sig ... ok270271test result: ok. 6 passed; 0 failed; 0 ignored; 0 measured; 0 filtered out; finished in 0.01s272273 Running unittests src/lib.rs (target/release/deps/tinc_proto-f33a78d6ef722c58)274275running 59 tests276test addr::tests::accepts ... ok277test addr::tests::rejects ... ok278test msg::edge::tests::add_edge_bad_name_rejected ... ok279test msg::edge::tests::add_edge_kat ... ok280test msg::edge::tests::add_edge_negative_weight_clamped ... ok281test msg::edge::tests::add_edge_self_loop_rejected ... ok282test msg::edge::tests::add_edge_seven_tokens_rejected ... ok283test msg::edge::tests::add_edge_unknown_addr ... ok284test msg::edge::tests::add_edge_v6 ... ok285test msg::edge::tests::add_edge_with_local ... ok286test msg::edge::tests::del_edge_kat ... ok287test msg::key::tests::ans_key ... ok288test msg::key::tests::ans_key_eight_fields_rejected ... ok289test msg::key::tests::ans_key_sptps_placeholder_fields ... ok290test msg::key::tests::ans_key_with_relay_addr ... ok291test msg::key::tests::key_changed ... ok292test msg::key::tests::req_key_ext_no_payload ... ok293test msg::key::tests::req_key_ext_with_payload ... ok294test msg::key::tests::req_key_legacy ... ok295test msg::key::tests::req_key_punch_roundtrip ... ok296test msg::key::tests::req_key_reflexive_append ... ok297test msg::key::tests::req_key_unknown_reqno ... ok298test msg::misc::tests::mtu_info ... ok299test msg::misc::tests::sptps_packet ... ok300test msg::misc::tests::tcp_packet ... ok301test msg::misc::tests::udp_info ... ok302test msg::subnet::tests::kat_format ... ok303test msg::subnet::tests::kat_parse ... ok304test msg::subnet::tests::rejects ... ok305test msg::subnet::tests::roundtrip ... ok306test msg::subnet::tests::trailing_garbage_ok ... ok307test request::tests::id_roundtrip ... ok308test request::tests::peek ... ok309test subnet::tests::kat_reject ... ok310test subnet::tests::kat_roundtrip ... ok311test subnet::tests::mac_shadows_v6 ... ok312test subnet::tests::maskcheck_basics ... ok313test subnet::tests::maskcmp_byte_aligned ... ok314test subnet::tests::maskcmp_mask_equivalence ... ok315test subnet::tests::maskcmp_partial_byte ... ok316test subnet::tests::maskcmp_slash_zero ... ok317test subnet::tests::maskcmp_v6 ... ok318test subnet::tests::matches_address_mode_v4 ... ok319test subnet::tests::matches_address_mode_v6 ... ok320test subnet::tests::matches_exact_mode_v4 ... ok321test subnet::tests::matches_ignores_weight ... ok322test subnet::tests::matches_mac ... ok323test subnet::tests::matches_type_mismatch ... ok324test tests::check_id_basics ... ok325test tok::tests::basic ... ok326test tok::tests::hex_lowercase_only ... ok327test tok::tests::ld_type ... ok328test tok::tests::limits ... ok329test tok::tests::lit_match ... ok330test tok::tests::lit_mismatch ... ok331test tok::tests::lu_accepts_negative_glibc_style ... ok332test tok::tests::opt ... ok333test tok::tests::skip ... ok334test tok::tests::typed ... ok335336test result: ok. 59 passed; 0 failed; 0 ignored; 0 measured; 0 filtered out; finished in 0.00s337338 Running tests/adversarial.rs (target/release/deps/adversarial-2db391451680ffca)339340running 10 tests341test add_edge_adversarial ... ok342test check_id_garbage ... ok343test del_edge_adversarial ... ok344test key_msgs_adversarial ... ok345test misc_msgs_adversarial ... ok346test request_peek_garbage ... ok347test subnet_adversarial ... ok348test subnet_msg_adversarial ... ok349test arbitrary_bytes_never_panic ... ok350test arbitrary_tokens_never_panic ... ok351352test result: ok. 10 passed; 0 failed; 0 ignored; 0 measured; 0 filtered out; finished in 0.08s353354 Running tests/roundtrip.rs (target/release/deps/roundtrip-b3fb150478161852)355356running 11 tests357test mac_never_parses_as_v6 ... ok358test subnet_fits_buffer ... ok359test v6_display_never_macish ... ok360test subnet_roundtrip ... ok361test subnet_canonical ... ok362test mtu_info ... ok363test del_edge ... ok364test req_key ... ok365test udp_info ... ok366test add_edge ... ok367test ans_key ... ok368369test result: ok. 11 passed; 0 failed; 0 ignored; 0 measured; 0 filtered out; finished in 0.05s370371 Running unittests src/lib.rs (target/release/deps/tinc_sptps-72dab3a01d090462)372373running 1 test374test state::tests::output_debug_redacts_payload_bytes ... ok375376test result: ok. 1 passed; 0 failed; 0 ignored; 0 measured; 0 filtered out; finished in 0.00s377378 Running tests/sptps/main.rs (target/release/deps/sptps-36aa2fe534c0af50)379380running 38 tests381test fastpath::u64_truncate_is_u32_wrap ... ok382test fastpath::open_data_into_pre_handshake_is_invalid_state ... ok383test aead::aead_mismatch_fails_at_sig ... ok384test framing::datagram_plaintext_malformed ... ok385test framing::stream_double_kex_is_err ... ok386test framing::stream_empty_input_is_noop ... ok387test aead::aes_gcm_roundtrip ... ok388test framing::datagram_encrypted_garbage ... ok389test fastpath::open_data_into_scrubs_out_on_error ... ok390test fastpath::handle_based_seal_byte_identical ... ok391test fastpath::open_data_into_badrecord_keeps_window ... ok392test fastpath::seal_into_open_into_roundtrip ... ok393test framing::datagram_rekey_survives_malformed_handshake_record ... ok394test framing::stream_preauth_reclen_clamp ... ok395test framing::stream_hybrid_kex_passes_clamp ... ok396test framing::stream_plaintext_bad_record_types ... ok397test fastpath::alloc_seqnos_seal_with_seqno_byte_identical ... ok398test hybrid::default_kex_byte_identical ... ok399test hybrid::hybrid_records_fit_meta_protocol ... ok400test aead::aes_and_chacha_records_differ ... ok401test hybrid::kex_mode_mismatch_is_badkex ... ok402test hybrid::hybrid_kdf_kat ... ok403test framing::stream_send_record_length_cap ... ok404test hybrid::tampered_ct_no_handshake_done ... ok405test hybrid::hybrid_roundtrip ... ok406test hybrid_confirm::no_record_before_handshake_done ... ok407test nonce_limit::alloc_seqnos_refuses_before_nonce_wrap ... ok408test hybrid_confirm::send_record_refused_in_confirm ... ok409test nonce_limit::rekey_due_at_soft_threshold ... ok410test nonce_limit::inband_datagram_rekey_rebases_key_counter ... ok411test small_order::small_order_ecdh_replayed_sig_no_panic_classical ... ok412test small_order::small_order_ecdh_replayed_sig_no_panic_hybrid ... ok413test rekey::hybrid_rekey_message_order ... ok414test rekey::rekey_roundtrip_all_modes ... ok415test hybrid::handshake_latency_report ... ok416test replay_window::in_window_reorder_is_lossless ... ok417test stream_reassembly::fragmentation_transparent_initiator ... ok418test stream_reassembly::fragmentation_transparent_responder ... ok419420test result: ok. 38 passed; 0 failed; 0 ignored; 0 measured; 0 filtered out; finished in 0.10s421422 Running tests/vs_c.rs (target/release/deps/vs_c-4b31b01e45a77ea0)423424running 6 tests425test byte_identical_wire_output ... ok426test datagram_rekey_keeps_seqno_monotone ... ok427test c_initiator_rust_responder_stream ... ok428test rust_initiator_c_responder_datagram ... ok429test rust_initiator_c_responder_stream ... ok430test stream_rekey_rust_initiator ... ok431432test result: ok. 6 passed; 0 failed; 0 ignored; 0 measured; 0 filtered out; finished in 0.01s433434 Running unittests src/lib.rs (target/release/deps/tinc_tools-ce11a2b381969a75)435436running 315 tests437test cmd::config::tests::edit_file_missing ... ok438test cmd::config::tests::del_filter_no_match_fails ... ok439test cmd::config::tests::add_dedup_noop ... ok440test cmd::config::tests::every_nonserver_var_is_host ... ok441test cmd::config::tests::add_dedup_case_insensitive ... ok442test cmd::config::tests::del_removes_all ... ok443test cmd::config::tests::del_nothing_fails ... ok444test cmd::config::tests::del_filtered ... ok445test cmd::config::tests::get_file_missing ... ok446test cmd::config::tests::add_appends ... ok447test cmd::config::tests::edit_adds_newline_before_append ... ok448test cmd::config::tests::edit_preserves_comments ... ok449test cmd::config::tests::edit_preserves_pem ... ok450test cmd::config::tests::intent_dual_tagged_goes_to_tinc_conf ... ok451test cmd::config::tests::get_table ... ok452test cmd::config::tests::intent_obsolete_var_fails ... ok453test cmd::config::tests::parse_var_expr_err ... ok454test cmd::config::tests::parse_var_expr_ok ... ok455test cmd::config::tests::intent_obsolete_var_get_ok ... ok456test cmd::config::tests::intent_errors ... ok457test cmd::config::tests::intent_action_coercion ... ok458test cmd::config::tests::intent_port_is_host_only ... ok459test cmd::config::tests::intent_unknown_var_force_proceeds ... ok460test cmd::config::tests::intent_routing ... ok461test cmd::config::tests::get_port_with_value_skips_pidfile ... ok462test cmd::config::tests::intent_unknown_var_get_proceeds ... ok463test cmd::config::tests::run_full_get ... ok464test cmd::config::tests::run_full_add_subnet_to_host_file ... ok465test cmd::config::tests::run_full_get_not_found ... ok466test cmd::config::tests::run_get_port_explicit_node_skips_pidfile ... ok467test cmd::config::tests::run_full_get_overlay_host ... ok468test cmd::config::tests::run_full_explicit_node ... ok469test cmd::config::tests::set_canonicalizes_key_case ... ok470test cmd::config::tests::run_get_port_fallback_to_config ... ok471test cmd::config::tests::split_line_pem_passthrough ... ok472test cmd::config::tests::split_line_table ... ok473test cmd::ctl_simple::tests::disconnect_bad_name_preflight ... ok474test cmd::ctl_simple::tests::debug_returns_prev_level ... ok475test cmd::ctl_simple::tests::disconnect_not_found ... ok476test cmd::ctl_simple::tests::pid_from_greeting ... ok477test cmd::ctl_simple::tests::reload_daemon_fail ... ok478test cmd::ctl_simple::tests::stop_drains ... ok479test cmd::dump::tests::conn_fmt_plain_contract ... ok480test cmd::dump::tests::conn_parse_golden ... ok481test cmd::dump::tests::edge_dot_weight_calc ... ok482test cmd::dump::tests::edge_dot_dedup_table ... ok483test cmd::dump::tests::edge_fmt_plain ... ok484test cmd::dump::tests::edge_parse_golden ... ok485test cmd::dump::tests::edge_parse_unspec_local ... ok486test cmd::config::tests::set_appends_when_absent ... ok487test cmd::config::tests::run_get_port_from_pidfile ... ok488test cmd::config::tests::run_get_with_value_is_set ... ok489test cmd::config::tests::tmpfile_cleaned_up_on_del_failure ... ok490test cmd::config::tests::set_collapses_duplicates ... ok491test cmd::dump::tests::kind_err ... ok492test cmd::dump::tests::kind_needs_daemon ... ok493test cmd::dump::tests::kind_ok ... ok494test cmd::dump::tests::node_dot_color_cascade ... ok495test cmd::dump::tests::node_fmt_plain_contract ... ok496test cmd::dump::tests::node_parse_golden ... ok497test cmd::dump::tests::node_parse_host_variants ... ok498test cmd::dump::tests::node_parse_short ... ok499test cmd::dump::tests::strip_weight_table ... ok500test cmd::dump::tests::subnet_fmt_table ... ok501test cmd::dump::tests::subnet_parse_table ... ok502test cmd::edit::tests::resolve_err ... ok503test cmd::edit::tests::resolve_ok ... ok504test cmd::config::tests::set_warnonremove ... ok505test cmd::config::tests::set_replaces_in_place ... ok506test cmd::config::tests::warnonremove_case_insensitive ... ok507test cmd::dump::tests::inv_empty_cases ... ok508test cmd::dump::tests::inv_multiple ... ok509test cmd::exchange::tests::export_all_separator_between ... ok510test cmd::dump::tests::inv_mixed ... ok511test cmd::exchange::tests::export_all_includes_overlay ... ok512test cmd::edit::tests::resolve_overlay_host ... ok513test cmd::exchange::tests::export_injects_name_strips_name ... ok514test cmd::exchange::tests::export_preserves_pem ... ok515test cmd::exchange::tests::get_my_name_no_name_key ... ok516test cmd::exchange::tests::get_my_name_missing_tinc_conf ... ok517test cmd::exchange::tests::import_bad_name_is_error ... ok518test cmd::dump::tests::inv_valid_table ... ok519test cmd::dump::tests::inv_roundtrip_with_invite ... ok520test cmd::exchange::tests::name_line_filter ... ok521test cmd::exchange::tests::export_all_skips_non_id_dirents ... ok522test cmd::exchange::tests::get_my_name_reads_config ... ok523test cmd::exchange::tests::import_no_name_at_all ... ok524test cmd::exchange::tests::import_multi_with_separator ... ok525test cmd::exchange::tests::import_skip_existing_unless_force ... ok526test cmd::exchange::tests::import_basic ... ok527test cmd::exchange::tests::import_junk_before_name_is_ignored ... ok528test cmd::exchange::tests::import_name_format_is_exact ... ok529test cmd::fsck::tests::display_exhaustive ... ok530test cmd::exchange::tests::roundtrip ... ok531test cmd::exchange::tests::roundtrip_multi ... ok532test cmd::dump::tests::inv_skipped ... ok533test cmd::fsck::tests::bad_b64_is_no_pubkey ... ok534test cmd::fsck::tests::clean_init_passes ... ok535test cmd::fsck::tests::duplicate_non_multiple ... ok536test cmd::fsck::tests::checks_all_hosts ... ok537test cmd::fsck::tests::duplicate_multiple_ok ... ok538test cmd::fsck::tests::confd_checked ... ok539test cmd::fsck::tests::all_known_scripts ... ok540test cmd::fsck::tests::host_file_deleted ... ok541test cmd::fsck::tests::no_name ... ok542test cmd::fsck::tests::host_var_in_server ... ok543test cmd::fsck::tests::no_tincconf ... ok544test cmd::fsck::tests::key_mismatch ... ok545test cmd::fsck::tests::host_scripts_any_prefix ... ok546test cmd::fsck::tests::hosts_non_id_skipped ... ok547test cmd::fsck::tests::no_private_key ... ok548test cmd::fsck::tests::no_public_key ... ok549test cmd::fsck::tests::obsolete_var ... ok550test cmd::fsck::tests::severity_buckets ... ok551test cmd::fsck::tests::key_mismatch_force_fixes ... ok552test cmd::fsck::tests::non_scripts_ignored ... ok553test cmd::fsck::tests::pem_pubkey_read ... ok554test cmd::fsck::tests::script_not_exec_warns ... ok555test cmd::fsck::tests::script_not_exec_force_fixes ... ok556test cmd::fsck::tests::private_key_file_config ... ok557test cmd::fsck::tests::no_public_key_force_fixes ... ok558test cmd::fsck::tests::server_var_in_host ... ok559test cmd::genkey::tests::disable_config_line_case ... ok560test cmd::genkey::tests::disable_config_line ... ok561test cmd::genkey::tests::disable_config_line_exact_len ... ok562test cmd::fsck::tests::unknown_script ... ok563test cmd::genkey::tests::disable_nonexistent ... ok564test cmd::genkey::tests::disable_ignores_rsa ... ok565test cmd::genkey::tests::disable_no_match ... ok566test cmd::genkey::tests::disable_end_type_unchecked ... ok567test cmd::genkey::tests::disable_pem_block ... ok568test cmd::fsck::tests::unsafe_key_mode_force_fixes ... ok569test cmd::genkey::tests::disable_no_trailing_newline ... ok570test cmd::info::tests::cascade_table ... ok571test cmd::fsck::tests::unknown_var_silent ... ok572test cmd::info::tests::localtime_zero_is_never ... ok573test cmd::info::tests::nodeinfo_format_golden ... ok574test cmd::info::tests::nodeinfo_format_unreachable ... ok575test cmd::info::tests::nodeinfo_status_order ... ok576test cmd::genkey::tests::disable_pem_block_surrounded ... ok577test cmd::info::tests::nodeinfo_traffic_double_space ... ok578test cmd::info::tests::option_bits_match_connection_h ... ok579test cmd::info::tests::option_version_shifts_24 ... ok580test cmd::info::tests::localtime_epoch_is_1970ish ... ok581test cmd::info::tests::reachability_display_directup_multiline ... ok582test cmd::info::tests::localtime_shape ... ok583test cmd::genkey::tests::disable_space_delimited_type ... ok584test cmd::info::tests::reachability_display_single_line ... ok585test cmd::genkey::tests::disable_preserves_mode ... ok586test cmd::info::tests::reachability_display_zero_rtt ... ok587test cmd::fsck::tests::unsafe_key_mode_warns ... ok588test cmd::info::tests::status_bits_match_node_h_order ... ok589test cmd::fsck::tests::server_var_in_overlay_host ... ok590test cmd::init::tests::bad_name_rejected ... ok591test cmd::init::tests::eacces_on_mkdir_hints_at_dash_c ... ok592test cmd::genkey::tests::rotation_roundtrip ... ok593test cmd::init::tests::makedir_clamps_mode ... ok594test cmd::genkey::tests::disable_config_line_delims ... ok595test cmd::invite::tests::address_basic ... ok596test cmd::init::tests::reinit_fails ... ok597test cmd::init::tests::fresh_init ... ok598test cmd::invite::tests::address_port_zero_bails ... ok599test cmd::invite::tests::address_missing_bails ... ok600test cmd::invite::tests::address_ipv6_brackets ... ok601test cmd::invite::tests::address_with_port_on_line ... ok602test cmd::invite::tests::address_port_from_config ... ok603test cmd::invite::tests::copy_host_table ... ok604test cmd::invite::tests::invite_existing_host_fails ... ok605test cmd::invite::tests::invite_no_address_fails_clean ... ok606test cmd::invite::tests::corrupt_key_with_live_invites_not_clobbered ... ok607test cmd::invite::tests::invite_bad_name_fails ... ok608test cmd::invite::tests::sweep_deletes_expired ... ok609test cmd::invite::tests::invite_existing_overlay_host_fails ... ok610test cmd::invite::tests::sweep_filters_by_filename_length ... ok611test cmd::invite::tests::invite_full_flow ... ok612test cmd::join::tests::finalize_existing_tinc_conf ... ok613test cmd::join::tests::finalize_bad_name ... ok614test cmd::join::tests::finalize_identity_rejects_bad_blob ... ok615test cmd::join::tests::finalize_identity_writes_only_the_key ... ok616test cmd::invite::tests::mesh_vars_copied ... ok617test cmd::join::tests::finalize_no_name ... ok618test cmd::join::tests::finalize_force_accepts_unsafe ... ok619test cmd::invite::tests::second_invite_reuses_key ... ok620test cmd::join::tests::finalize_ifconfig_recognized_stubbed ... ok621test cmd::join::tests::greeting_line1 ... ok622test cmd::join::tests::greeting_line2 ... ok623test cmd::join::tests::finalize_minimal_blob ... ok624test cmd::join::tests::finalize_self_clobber_detected ... ok625test cmd::join::tests::finalize_self_clobber_is_case_insensitive ... ok626test cmd::join::tests::split_var_forms ... ok627test cmd::join::tests::url_err ... ok628test cmd::join::tests::url_ok ... ok629test cmd::join::tests::finalize_secondary_chunk_drops_dangerous_keys ... ok630test cmd::network::tests::list_anonymous_network ... ok631test cmd::join::tests::finalize_secondary_chunks ... ok632test cmd::network::tests::list_missing_confdir ... ok633test cmd::join::tests::finalize_unknown_var_dropped ... ok634test cmd::network::tests::list_empty ... ok635test cmd::join::tests::finalize_var_safe_filter ... ok636test cmd::network::tests::list_skip_no_tinc_conf ... ok637test cmd::network::tests::list_skip_regular_files ... ok638test cmd::network::tests::run_switch_dot_different_advice ... ok639test cmd::network::tests::run_switch_rejected ... ok640test cmd::network::tests::list_skip_dotted ... ok641test cmd::join::tests::server_stub_single_use ... ok642test cmd::join::tests::url_roundtrip_with_invite ... ok643test cmd::join::tests::server_stub_recovers_file ... ok644test cmd::network::tests::list_skip_unreadable ... ok645test cmd::network::tests::list_three_sorted ... ok646test cmd::sign::tests::signed_message_format ... ok647test cmd::sign::tests::load_host_pubkey_no_key ... ok648test cmd::sign::tests::binary_body_roundtrip ... ok649test cmd::sign::tests::load_host_pubkey_pem_fallback ... ok650test cmd::sign::tests::empty_body_roundtrip ... ok651test cmd::sign::tests::sign_verify_roundtrip ... ok652test cmd::sign::tests::golden_upstream_vector ... ok653test cmd::sign::tests::signer_parse ... ok654test cmd::sign::tests::trailer_leading_space ... ok655test cmd::sign::tests::verify_malformed_header ... ok656test cmd::sign::tests::verify_header_too_long ... ok657test cmd::start::tests::find_tincd_env_override ... ok658test cmd::sign::tests::verify_any_signer ... ok659test cmd::sign::tests::verify_signer_mismatch ... ok660test cmd::join::tests::invite_join_roundtrip_in_process ... ok661test cmd::stream::tests::log_loop_color_forwarded ... ok662test cmd::start::tests::start_proceeds_past_missing_pidfile ... ok663test cmd::stream::tests::log_loop_data_with_newline ... ok664test cmd::stream::tests::log_loop_malformed_breaks_clean ... ok665test cmd::stream::tests::log_loop_two_records ... ok666test cmd::stream::tests::parse_header_table ... ok667test cmd::stream::tests::pcap_global_header_bytes_le ... ok668test cmd::stream::tests::pcap_global_header_snaplen_zero_defaults ... ok669test cmd::stream::tests::pcap_loop_one_packet ... ok670test cmd::stream::tests::pcap_loop_snaplen_zero ... ok671test cmd::stream::tests::pcap_loop_timestamps_per_packet ... ok672test cmd::stream::tests::pcap_packet_header_before_epoch_is_zero ... ok673test cmd::start::tests::start_proceeds_past_malformed_pidfile ... ok674test cmd::stream::tests::pcap_packet_header_bytes_le ... ok675test cmd::stream::tests::pcap_packet_header_y2038_truncates ... ok676test cmd::sign::tests::verify_tampered_body ... ok677test cmd::top::tests::compare_table ... ok678test cmd::top::tests::counter_decrease_wraps ... ok679test cmd::top::tests::departed_node_stays_dim ... ok680test cmd::top::tests::display_order_is_arrival_order_not_name_order ... ok681test cmd::top::tests::first_tick_rate_is_near_zero ... ok682test cmd::top::tests::fractional_dt ... ok683test cmd::top::tests::parse_traffic_row ... ok684test cmd::top::tests::render_clips_at_max_rows ... ok685test cmd::top::tests::render_header_row0_golden ... ok686test cmd::top::tests::render_header_row2_text ... ok687test cmd::top::tests::render_header_no_netname ... ok688test cmd::top::tests::render_row_column_layout ... ok689test cmd::top::tests::render_row_cumulative ... ok690test cmd::top::tests::render_row_kilo_scale ... ok691test cmd::top::tests::second_tick_rate_is_delta_over_dt ... ok692test cmd::top::tests::sort_name_is_ascending ... ok693test cmd::top::tests::render_row_attribute_logic ... ok694test cmd::sign::tests::verify_signer_in_overlay ... ok695test ctl::tests::ack_nonzero_result ... ok696test ctl::tests::handshake_bad_line1 ... ok697test cmd::sign::tests::verify_tampered_time ... ok698test ctl::tests::handshake_smoke ... ok699test ctl::tests::pidfile_missing ... ok700test ctl::tests::handshake_bad_cookie_eof ... ok701test ctl::tests::recv_data_after_recv_line_shared_buffer ... ok702test ctl::tests::recv_data_short_is_error ... ok703test ctl::tests::recv_ack_wrong_type ... ok704test ctl::tests::recv_lines_until_eof ... ok705test ctl::tests::recv_row_basic ... ok706test ctl::tests::recv_row_bad_code ... ok707test ctl::tests::request_from_i32 ... ok708test ctl::tests::pidfile_parse ... ok709test ctl::tests::recv_row_eof_mid_dump ... ok710test cmd::sign::tests::verify_tampered_signer_name ... ok711test ctl::tests::recv_row_graph_two_terminators ... ok712test ctl::tests::send_and_ack ... ok713test ctl::tests::recv_row_trailing_space_is_terminator ... ok714test ctl::tests::send_int2_wire ... ok715test ctl::tests::pidfile_cookie_validated ... ok716test ctl::tests::pidfile_shape_enforced ... ok717test ctl::tests::send_with_int_arg ... ok718test idp::tests::form_parsing_decodes ... ok719test ctl::tests::send_with_str_arg ... ok720test ctl::tests::stop_drains_to_eof ... ok721test idp::tests::state_round_trips_and_query_merges ... ok722test idp::tests::authorize_errors_redirect_after_validation ... ok723test idp::tests::authorize_rejects_before_redirect_validation ... ok724test idp::tests::discovery_has_required_fields ... ok725test idp::tests::token_redirect_uri_must_match_code ... ok726test keypair::tests::wrong_type_fails ... ok727test names::tests::check_id_charset ... ok728test names::tests::confbase_from_netname ... ok729test names::tests::explicit_confbase_wins ... ok730test idp::tests::sweep_drops_expired_state ... ok731test idp::tests::pkce_s256 ... ok732test names::tests::neither_given ... ok733test idp::tests::code_is_single_use_and_expires ... ok734test keypair::tests::roundtrip_via_disk ... ok735test names::tests::replace_name_envvar_missing ... ok736test names::tests::replace_name_envvar_squashes ... ok737test names::tests::pidfile_before_resolve_panics - should panic ... ok738test idp::tests::full_code_flow ... ok739test names::tests::host_dirs_reads_conf_d ... ok740test names::tests::replace_name_literal ... ok741test names::tests::replace_name_host_falls_through ... ok742test names::tests::unix_socket_case_sensitive ... ok743test names::tests::unix_socket_dot_pid_replaced ... ok744test names::tests::unix_socket_exactly_dot_pid ... ok745test names::tests::unix_socket_no_dot_pid_appended ... ok746test tui::tests::goto_adjusts_to_one_indexed ... ok747test names::tests::resolve_runtime_confbase_fallback ... ok748test idp::tests::userinfo_rejects_expired_and_unknown ... ok749test idp::tests::token_client_auth ... ok750test cmd::invite::tests::invitation_created_hook_can_edit_file ... ok751test cmd::invite::tests::invitation_created_hook_failure_aborts ... ok752753test result: ok. 315 passed; 0 failed; 0 ignored; 0 measured; 0 filtered out; finished in 0.72s754755 Running unittests src/bin/sptps_keypair.rs (target/release/deps/sptps_keypair-0f4d68ba82d53401)756757running 0 tests758759test result: ok. 0 passed; 0 failed; 0 ignored; 0 measured; 0 filtered out; finished in 0.00s760761 Running unittests src/bin/sptps_test.rs (target/release/deps/sptps_test-1302855acfcd2996)762763running 0 tests764765test result: ok. 0 passed; 0 failed; 0 ignored; 0 measured; 0 filtered out; finished in 0.00s766767 Running unittests src/bin/tinc.rs (target/release/deps/tinc-31c34b3462130617)768769running 0 tests770771test result: ok. 0 passed; 0 failed; 0 ignored; 0 measured; 0 filtered out; finished in 0.00s772773 Running unittests src/bin/tinc-auth.rs (target/release/deps/tinc_auth-aa70e10f9c552aab)774775running 0 tests776777test result: ok. 0 passed; 0 failed; 0 ignored; 0 measured; 0 filtered out; finished in 0.00s778779 Running tests/self_roundtrip.rs (target/release/deps/self_roundtrip-96acc761abdd093d)780781running 8 tests782test init_keys_load_in_c ... ok783test stream ... ok784test stream_large_payload ... ok785test cross_pem_private_keys ... ok786test stream_swapped_roles ... ok787test cross_stream_large_payload ... ok788test datagram ... ok789test cross_matrix ... ok790791test result: ok. 8 passed; 0 failed; 0 ignored; 0 measured; 0 filtered out; finished in 7.39s792793 Running tests/tinc_cli/main.rs (target/release/deps/tinc_cli-3089be2400235853)794795running 71 tests796test argv::help_commands_aligned ... FAILED797test argv::glued_short_c ... ok798test argv::network_command ... ok799test argv::dispatch_errors ... ok800test argv::help_and_version_aliases ... ok801test config::config_replace_is_set ... ok802test argv::netname_sources ... ok803test ctl::disconnect_validates_before_connecting ... ok804test config::get_name ... ok805test config::add_appends_del_removes_all ... ok806test ctl::pidfile_missing ... ok807test ctl::pidfile_malformed ... ok808test ctl::pid_comes_from_greeting ... ok809test config::set_unknown_variable_needs_force ... ok810test config::set_reloads_daemon_if_running ... ok811test dump::dump_graph_dedups_edges ... ok812test dump::dump_digraph ... ok813test ctl::reload_round_trip ... ok814test config::edits_pass_fsck ... ok815test ctl::reload_reports_daemon_error ... ok816test dump::dump_nodes_formats_like_c ... ok817test dump::dump_unknown_type ... ok818test dump::dump_reachable_nodes_filters ... ok819test dump::dump_subnets ... ok820test dump::list_nodes_alias ... ok821test edit::edit_arity ... ok822test edit::edit_rejects_path_traversal ... ok823test export_import::export_needs_tinc_conf ... ok824test dump::dump_invitations_without_daemon ... ok825test fsck::clean_init_is_silent ... ok826test export_import::export_all_then_import ... ok827test export_import::import_existing_needs_force ... ok828test fsck::missing_confbase_suggests_init ... ok829test export_import::export_then_import ... ok830test genkey::generate_keys_needs_tinc_conf ... ok831test fsck::warning_exits_zero ... ok832test edit::editor_exit_status_propagates ... ok833test fsck::force_fixes_missing_public_key ... ok834test genkey::generate_keys_rotates ... ok835test info::info_address ... ok836test info::info_invalid_argument ... ok837test info::info_node ... ok838test info::info_unknown_address ... ok839test info::info_unknown_node_stops_after_nodes ... ok840test init::init_creates_confbase ... ok841test edit::editor_invocation_via_shell ... ok842test init::init_glued_config_option ... ok843test init::init_name_from_stdin ... ok844test invite_join::invite_needs_name ... ok845test invite_join::invite_records_netname ... ok846test invite_join::invite_prints_url ... ok847test invite_join::invite_without_address ... ok848test invite_join::join_rejects_bad_url ... ok849test invite_join::join_with_existing_config_fails_before_connect ... ok850test sign_verify::sign_verify_need_config_and_signer ... ok851test invite_join::join_identity_only_preflight ... ok852test top_log_pcap::log_level_forwarded ... ok853test top_log_pcap::log_prints_pushed_records ... ok854test top_log_pcap::log_rejects_garbage_level ... ok855test top_log_pcap::pcap_rejects_negative_snaplen ... ok856test top_log_pcap::pcap_writes_savefile ... ok857test top_log_pcap::top_connects_then_fails_on_non_tty ... ok858test top_log_pcap::top_too_many_args ... ok859test sign_verify::verify_on_another_node ... ok860test sign_verify::sign_verify_roundtrip ... ok861test argv::tinc_auth_glued_long_opts ... ok862test auth_http::auth_bad_requests_and_daemon_down ... ok863test auth_http::auth_by_subnet_owner ... ok864test argv::tinc_auth_sockpath_alias ... ok865test idp_http::idp_refuses_foreign_bind ... ok866test idp_http::idp_full_flow_over_http ... ok867868failures:869870---- argv::help_commands_aligned stdout ----871872thread 'argv::help_commands_aligned' (66788525) panicked at crates/tinc-tools/tests/tinc_cli/argv.rs:94:36:873no column separator in " join [--identity-only [--output-key FILE]] INVITATION"874note: run with `RUST_BACKTRACE=1` environment variable to display a backtrace875876877failures:878 argv::help_commands_aligned879880test result: FAILED. 70 passed; 1 failed; 0 ignored; 0 measured; 0 filtered out; finished in 0.27s881882error: test failed, to rerun pass `-p tinc-tools --test tinc_cli`