tincd-test-0.1.0
checks.aarch64-darwin.tincd-test
· build #124
· raw
unpackPhase
1unpacking source archive /nix/store/byd02mkrmzmsa32nyw2sadvsfcajlv4q-source2source root is sourcepatchPhase
3Executing configureCargoCommonVars4decompressing cargo artifacts from /nix/store/50n7r9r65j5l2m0fl1kb4b3q6gd4cvjm-tincd-deps-0.1.0/target.tar.zst to targetconfigurePhase
5will append /nix/var/nix/builds/nix-12330-3153559171/source/.cargo-home/config.toml with contents of /nix/store/lpsqnbqg9hb1v0fzkvjd69a36ic6x1yz-vendor-cargo-deps/config.toml6default configurePhase, nothing to dobuildPhase
7+++ command cargo --version8cargo 1.97.0 (c980f4866 2026-06-30)checkPhase
9+++ command cargo test --release --workspace10 Compiling num-traits v0.2.1911 Compiling rustix v1.1.412 Compiling errno v0.3.1413 Compiling fastrand v2.4.014 Compiling once_cell v1.21.415 Compiling zerocopy v0.8.5616 Compiling tinc-proto v0.0.0 (/nix/var/nix/builds/nix-12330-3153559171/source/crates/tinc-proto)17 Compiling tinc-device v0.0.0 (/nix/var/nix/builds/nix-12330-3153559171/source/crates/tinc-device)18 Compiling tincd v0.1.0 (/nix/var/nix/builds/nix-12330-3153559171/source/crates/tincd)19 Compiling getrandom v0.3.420 Compiling wait-timeout v0.2.121 Compiling quick-error v1.2.322 Compiling bit-vec v0.8.023 Compiling fnv v1.0.724 Compiling unarray v0.1.425 Compiling bit-set v0.8.026 Compiling regex-syntax v0.8.1127 Compiling tinc-ffi v0.0.0 (/nix/var/nix/builds/nix-12330-3153559171/source/crates/tinc-ffi)28 Compiling inout v0.2.229 Compiling hex v0.4.330 Compiling rand_core v0.9.531 Compiling rand_xorshift v0.4.032 Compiling module-lattice v0.2.333 Compiling crypto-bigint v0.7.534 Compiling rand v0.9.235warning: tincd@0.1.0: Warning: supplying the --target arm64-apple-macosx != arm64-apple-darwin argument to a nix-wrapped compiler may not work correctly - cc-wrapper is currently not designed with multi-target compilers in mind. You may want to use an un-wrapped compiler instead.36 Compiling cipher v0.5.237 Compiling ml-kem v0.3.238 Compiling chacha20 v0.10.239 Compiling tempfile v3.27.040 Compiling rusty-fork v0.3.141warning: tinc-ffi@0.0.0: Warning: supplying the --target arm64-apple-macosx != arm64-apple-darwin argument to a nix-wrapped compiler may not work correctly - cc-wrapper is currently not designed with multi-target compilers in mind. You may want to use an un-wrapped compiler instead.42warning: tinc-ffi@0.0.0: Warning: supplying the --target arm64-apple-macosx != arm64-apple-darwin argument to a nix-wrapped compiler may not work correctly - cc-wrapper is currently not designed with multi-target compilers in mind. You may want to use an un-wrapped compiler instead.43warning: tinc-ffi@0.0.0: Warning: supplying the --target arm64-apple-macosx != arm64-apple-darwin argument to a nix-wrapped compiler may not work correctly - cc-wrapper is currently not designed with multi-target compilers in mind. You may want to use an un-wrapped compiler instead.44warning: tinc-ffi@0.0.0: Warning: supplying the --target arm64-apple-macosx != arm64-apple-darwin argument to a nix-wrapped compiler may not work correctly - cc-wrapper is currently not designed with multi-target compilers in mind. You may want to use an un-wrapped compiler instead.45warning: tinc-ffi@0.0.0: Warning: supplying the --target arm64-apple-macosx != arm64-apple-darwin argument to a nix-wrapped compiler may not work correctly - cc-wrapper is currently not designed with multi-target compilers in mind. You may want to use an un-wrapped compiler instead.46warning: tinc-ffi@0.0.0: Warning: supplying the --target arm64-apple-macosx != arm64-apple-darwin argument to a nix-wrapped compiler may not work correctly - cc-wrapper is currently not designed with multi-target compilers in mind. You may want to use an un-wrapped compiler instead.47warning: tinc-ffi@0.0.0: Warning: supplying the --target arm64-apple-macosx != arm64-apple-darwin argument to a nix-wrapped compiler may not work correctly - cc-wrapper is currently not designed with multi-target compilers in mind. You may want to use an un-wrapped compiler instead.48warning: tinc-ffi@0.0.0: Warning: supplying the --target arm64-apple-macosx != arm64-apple-darwin argument to a nix-wrapped compiler may not work correctly - cc-wrapper is currently not designed with multi-target compilers in mind. You may want to use an un-wrapped compiler instead.49warning: tinc-ffi@0.0.0: Warning: supplying the --target arm64-apple-macosx != arm64-apple-darwin argument to a nix-wrapped compiler may not work correctly - cc-wrapper is currently not designed with multi-target compilers in mind. You may want to use an un-wrapped compiler instead.50warning: tinc-ffi@0.0.0: Warning: supplying the --target arm64-apple-macosx != arm64-apple-darwin argument to a nix-wrapped compiler may not work correctly - cc-wrapper is currently not designed with multi-target compilers in mind. You may want to use an un-wrapped compiler instead.51warning: tinc-ffi@0.0.0: Warning: supplying the --target arm64-apple-macosx != arm64-apple-darwin argument to a nix-wrapped compiler may not work correctly - cc-wrapper is currently not designed with multi-target compilers in mind. You may want to use an un-wrapped compiler instead.52warning: tinc-ffi@0.0.0: Warning: supplying the --target arm64-apple-macosx != arm64-apple-darwin argument to a nix-wrapped compiler may not work correctly - cc-wrapper is currently not designed with multi-target compilers in mind. You may want to use an un-wrapped compiler instead.53warning: tinc-ffi@0.0.0: Warning: supplying the --target arm64-apple-macosx != arm64-apple-darwin argument to a nix-wrapped compiler may not work correctly - cc-wrapper is currently not designed with multi-target compilers in mind. You may want to use an un-wrapped compiler instead.54warning: tinc-ffi@0.0.0: Warning: supplying the --target arm64-apple-macosx != arm64-apple-darwin argument to a nix-wrapped compiler may not work correctly - cc-wrapper is currently not designed with multi-target compilers in mind. You may want to use an un-wrapped compiler instead.55warning: tinc-ffi@0.0.0: Warning: supplying the --target arm64-apple-macosx != arm64-apple-darwin argument to a nix-wrapped compiler may not work correctly - cc-wrapper is currently not designed with multi-target compilers in mind. You may want to use an un-wrapped compiler instead.56warning: tinc-ffi@0.0.0: Warning: supplying the --target arm64-apple-macosx != arm64-apple-darwin argument to a nix-wrapped compiler may not work correctly - cc-wrapper is currently not designed with multi-target compilers in mind. You may want to use an un-wrapped compiler instead.57 Compiling tinc-crypto v0.0.0 (/nix/var/nix/builds/nix-12330-3153559171/source/crates/tinc-crypto)58 Compiling tinc-sptps v0.0.0 (/nix/var/nix/builds/nix-12330-3153559171/source/crates/tinc-sptps)59 Compiling tinc-conf v0.0.0 (/nix/var/nix/builds/nix-12330-3153559171/source/crates/tinc-conf)60 Compiling crypto-primes v0.7.261 Compiling ppv-lite86 v0.2.2162 Compiling rand_chacha v0.10.063 Compiling rsa v0.10.0-rc.1864 Compiling rand_chacha v0.9.065 Compiling proptest v1.11.066 Compiling tinc-tools v0.0.0 (/nix/var/nix/builds/nix-12330-3153559171/source/crates/tinc-tools)67 Finished `release` profile [optimized] target(s) in 1m 18s68 Running unittests src/lib.rs (target/release/deps/tinc_conf-8af079b4ba6d94f2)6970running 62 tests71test name::tests::envvar_same_semantics_as_host ... ok72test name::tests::host_truncates_at_dot_and_squashes ... ok73test name::tests::host_env_beats_gethostname ... ok74test name::tests::literal_not_squashed ... ok75test name::tests::empty_after_truncate_errors ... ok76test hostdirs::tests::no_overlay_is_plain_hosts ... ok77test name::tests::underscore_preserved ... ok78test parse::tests::entry_bool ... ok79test parse::tests::entry_int ... ok80test parse::tests::file_bom_stripped ... ok81test parse::tests::file_comments_and_blanks ... ok82test parse::tests::file_crlf ... ok83test parse::tests::file_non_utf8_tolerated ... ok84test hostdirs::tests::names_overlay_missing_vs_unreadable ... ok85test parse::tests::file_skips_pem ... ok86test parse::tests::file_pem_unterminated ... ok87test parse::tests::line_blank_skips ... ok88test parse::tests::line_empty_value_errors ... ok89test parse::tests::line_empty_variable_passes ... ok90test parse::tests::line_equals_terminates_variable ... ok91test parse::tests::line_separator_forms ... ok92test parse::tests::line_trailing_strip ... ok93test parse::tests::line_value_with_spaces ... ok94test parse::tests::lookup_case_insensitive ... ok95test parse::tests::lookup_cmdline_first ... ok96test parse::tests::lookup_line_before_file ... ok97test parse::tests::lookup_file_tiebreak ... ok98test parse::tests::lookup_multi_ordered_by_line ... ok99test hostdirs::tests::dangling_symlink_occupies_name ... ok100test hostdirs::tests::overlay_equal_to_primary_is_ignored ... ok101test pem::tests::public_key_file_shape ... ok102test hostdirs::tests::overlay_overrides_primary ... ok103test parse::tests::server_no_tincconf ... ok104test parse::tests::server_no_confd ... ok105test parse::tests::server_confd_empty ... ok106test pem::tests::read_bad_b64 ... ok107test pem::tests::read_crlf ... ok108test pem::tests::read_empty_body_line ... ok109test pem::tests::read_end_type_unchecked ... ok110test pem::tests::read_ignores_chunking ... ok111test parse::tests::server_confd_is_file ... ok112test pem::tests::read_not_found ... ok113test parse::tests::server_confd_merged ... ok114test pem::tests::read_size_long ... ok115test pem::tests::read_size_short ... ok116test pem::tests::read_skips_preamble ... ok117test pem::tests::read_type_prefix ... ok118test parse::tests::server_confd_head_bug_not_ported ... ok119test pem::tests::roundtrip_sizes ... ok120test pem::tests::write_chunking ... ok121test pem::tests::write_chunking_uneven ... ok122test vars::tests::every_entry_is_server_or_host ... ok123test vars::tests::flags_contains ... ok124test pem::tests::signing_key_roundtrip ... ok125test vars::tests::lookup_case_insensitive ... ok126test vars::tests::lookup_unknown ... ok127test vars::tests::no_duplicate_names ... ok128test vars::tests::safe_not_obsolete ... ok129test vars::tests::spot_check ... ok130test vars::tests::unsafe_paths_not_safe ... ok131test parse::tests::server_confd_one_bad ... ok132test parse::tests::server_confd_filter ... ok133134test result: ok. 62 passed; 0 failed; 0 ignored; 0 measured; 0 filtered out; finished in 0.01s135136 Running tests/roundtrip.rs (target/release/deps/roundtrip-5875fc12309fe921)137138running 3 tests139test pem_roundtrip ... ok140test line_roundtrip ... ok141test pem_skips_preamble ... ok142143test result: ok. 3 passed; 0 failed; 0 ignored; 0 measured; 0 filtered out; finished in 0.02s144145 Running unittests src/lib.rs (target/release/deps/tinc_crypto-0aef1adf41afbdfc)146147running 14 tests148test aead::tests::default_label_suffix_empty ... ok149test aead::tests::config_str_roundtrip ... ok150test invite::tests::env_key ... ok151test invite::tests::cookie_affects_filename ... ok152test invite::tests::filename_from_cookie ... ok153test invite::tests::headers ... ok154test invite::tests::key_affects_slug_prefix_only ... ok155test invite::tests::key_hash_via_fingerprint ... ok156test hybrid::tests::mlkem768_round_trip ... ok157test invite::tests::parse_bad_alphabet ... ok158test invite::tests::parse_multibyte_no_panic ... ok159test invite::tests::parse_short ... ok160test invite::tests::slug_roundtrip ... ok161test aead::tests::aes_open_into_err_leaves_out_unchanged ... ok162163test result: ok. 14 passed; 0 failed; 0 ignored; 0 measured; 0 filtered out; finished in 0.00s164165 Running tests/kat.rs (target/release/deps/kat-5d1e883f980a82e8)166167running 9 tests168test b64_decode_accepts_mixed_alphabet ... ok169test b64_encode_matches_c ... ok170test prf_matches_c ... ok171test invitation_crypto_kernel_matches_c ... ok172test sign_matches_c ... ok173test ecdh_from_seed_matches_c ... ok174test chapoly_open_rejects_tampered ... ok175test aes256gcm_known_answer ... ok176test chapoly_seal_matches_c ... ok177178test result: ok. 9 passed; 0 failed; 0 ignored; 0 measured; 0 filtered out; finished in 0.01s179180 Running unittests src/lib.rs (target/release/deps/tinc_device-c7f92be68b4ba4fe)181182running 54 tests183test arena::tests::arena_is_page_aligned ... ok184test arena::tests::slot_accessors ... ok185test arena::tests::slots_within_contiguous ... ok186test arena::tests::slot_oob_panics - should panic ... ok187test bsd::tests::nibble_then_prefix_roundtrip ... ok188test arena::tests::set_len_rejects_overflow - should panic ... ok189test bsd::tests::prefix_ipv4_is_af_inet_be ... ok190test bsd::macos_x::tests::flush_replays_zero_progress_once ... ok191test bsd::macos_x::tests::flush_replays_partial_tail ... ok192test bsd::tests::prefix_ipv6_is_libc_af_inet6_be ... ok193test bsd::tests::prefix_unknown ... ok194test bsd::tests::tap_read_ether_via_seqpacket ... ok195test bsd::tests::read_unknown_nibble_errors ... ok196test bsd::tests::tap_write_ether_via_seqpacket ... ok197test bsd::tests::tun_read_ipv4_via_pipe ... ok198test bsd::tests::tun_utun_write_short_buf_errors ... ok199test bsd::tests::tun_write_strips_ether ... ok200test bsd::tests::utun_read_ignores_prefix ... ok201test bsd::tests::utun_read_runt_errors ... ok202test bsd::tests::utun_write_synthesizes_ipv6_prefix ... ok203test bsd::tests::utun_write_synthesizes_prefix ... ok204test bsd::tests::utun_write_unknown_ethertype_errors ... ok205test ether::tests::nibble_cases ... ok206test ether::tests::set_etherheader_cases ... ok207test fd::tests::read_eof_via_pipe ... ok208test fd::tests::read_ip_via_pipe ... ok209test fd::tests::read_unknown_version_via_pipe ... ok210test fd::tests::scm_rights_round_trip ... ok211test fd::tests::write_strips_ether_via_pipe ... ok212test tests::drain_clamps_cap_to_arena ... ok213test tests::drain_dummy_is_empty ... ok214test tests::drain_frames_until_eagain ... ok215test tests::drain_immediate_eagain_is_empty ... ok216test tests::drain_propagates_real_error ... ok217test tests::drain_respects_cap ... ok218test tso::tests::checksum_chains ... ok219test tso::tests::checksum_odd_tail ... ok220test tso::tests::checksum_rfc1071_reference ... ok221test tso::tests::gro_coalesce_three_v4 ... ok222test tso::tests::gro_flush_on_mismatch ... ok223test tso::tests::gro_hits_64k_cap ... ok224test tso::tests::gro_psh_terminates ... ok225test tso::tests::gro_reassembles_tso_split_output ... ok226test tso::tests::gro_rejects ... ok227test tso::tests::gro_short_tail_terminates ... ok228test tso::tests::gro_single_packet_zero_vnet_hdr ... ok229test tso::tests::gso_none_completes_partial_csum ... ok230test tso::tests::split_errors ... ok231test tso::tests::split_seq_wraps ... ok232test tso::tests::split_v4_even ... ok233test tso::tests::split_v4_short_tail ... ok234test tso::tests::split_v4_single_chunk ... ok235test tso::tests::split_v6_even ... ok236test tso::tests::vnet_hdr_decode ... ok237238test result: ok. 54 passed; 0 failed; 0 ignored; 0 measured; 0 filtered out; finished in 0.00s239240 Running tests/mq.rs (target/release/deps/mq-bba77c7ad2efda4c)241242running 0 tests243244test result: ok. 0 passed; 0 failed; 0 ignored; 0 measured; 0 filtered out; finished in 0.00s245246 Running tests/utun_batch.rs (target/release/deps/utun_batch-66556858cd64d370)247248running 3 tests249test utun_partial_drain_refires_kqueue ... ok250test utun_recvmsg_x_drain ... ok251test utun_sendmsg_x_inject ... ok252253test result: ok. 3 passed; 0 failed; 0 ignored; 0 measured; 0 filtered out; finished in 0.00s254255 Running unittests src/lib.rs (target/release/deps/tinc_ffi-e057d5b4ede8b5d5)256257running 0 tests258259test result: ok. 0 passed; 0 failed; 0 ignored; 0 measured; 0 filtered out; finished in 0.00s260261 Running tests/handshake.rs (target/release/deps/handshake-09d8538f10d116b4)262263running 6 tests264test datagram_handshake ... ok265test same_seeds_same_bytes ... ok266test stream_handshake ... ok267test stream_handshake_bytewise ... ok268test stream_rekey_uses_ack_state ... ok269test wrong_peer_key_fails_at_sig ... ok270271test result: ok. 6 passed; 0 failed; 0 ignored; 0 measured; 0 filtered out; finished in 0.01s272273 Running unittests src/lib.rs (target/release/deps/tinc_proto-f33a78d6ef722c58)274275running 59 tests276test addr::tests::accepts ... ok277test addr::tests::rejects ... ok278test msg::edge::tests::add_edge_bad_name_rejected ... ok279test msg::edge::tests::add_edge_kat ... ok280test msg::edge::tests::add_edge_negative_weight_clamped ... ok281test msg::edge::tests::add_edge_self_loop_rejected ... ok282test msg::edge::tests::add_edge_seven_tokens_rejected ... ok283test msg::edge::tests::add_edge_unknown_addr ... ok284test msg::edge::tests::add_edge_v6 ... ok285test msg::edge::tests::add_edge_with_local ... ok286test msg::edge::tests::del_edge_kat ... ok287test msg::key::tests::ans_key ... ok288test msg::key::tests::ans_key_eight_fields_rejected ... ok289test msg::key::tests::ans_key_sptps_placeholder_fields ... ok290test msg::key::tests::ans_key_with_relay_addr ... ok291test msg::key::tests::key_changed ... ok292test msg::key::tests::req_key_ext_no_payload ... ok293test msg::key::tests::req_key_ext_with_payload ... ok294test msg::key::tests::req_key_legacy ... ok295test msg::key::tests::req_key_punch_roundtrip ... ok296test msg::key::tests::req_key_reflexive_append ... ok297test msg::key::tests::req_key_unknown_reqno ... ok298test msg::misc::tests::mtu_info ... ok299test msg::misc::tests::sptps_packet ... ok300test msg::misc::tests::tcp_packet ... ok301test msg::misc::tests::udp_info ... ok302test msg::subnet::tests::kat_format ... ok303test msg::subnet::tests::kat_parse ... ok304test msg::subnet::tests::rejects ... ok305test msg::subnet::tests::roundtrip ... ok306test msg::subnet::tests::trailing_garbage_ok ... ok307test request::tests::id_roundtrip ... ok308test request::tests::peek ... ok309test subnet::tests::kat_reject ... ok310test subnet::tests::kat_roundtrip ... ok311test subnet::tests::mac_shadows_v6 ... ok312test subnet::tests::maskcheck_basics ... ok313test subnet::tests::maskcmp_byte_aligned ... ok314test subnet::tests::maskcmp_mask_equivalence ... ok315test subnet::tests::maskcmp_partial_byte ... ok316test subnet::tests::maskcmp_slash_zero ... ok317test subnet::tests::maskcmp_v6 ... ok318test subnet::tests::matches_address_mode_v4 ... ok319test subnet::tests::matches_address_mode_v6 ... ok320test subnet::tests::matches_exact_mode_v4 ... ok321test subnet::tests::matches_ignores_weight ... ok322test subnet::tests::matches_mac ... ok323test subnet::tests::matches_type_mismatch ... ok324test tests::check_id_basics ... ok325test tok::tests::basic ... ok326test tok::tests::hex_lowercase_only ... ok327test tok::tests::ld_type ... ok328test tok::tests::limits ... ok329test tok::tests::lit_match ... ok330test tok::tests::lit_mismatch ... ok331test tok::tests::lu_accepts_negative_glibc_style ... ok332test tok::tests::skip ... ok333test tok::tests::opt ... ok334test tok::tests::typed ... ok335336test result: ok. 59 passed; 0 failed; 0 ignored; 0 measured; 0 filtered out; finished in 0.00s337338 Running tests/adversarial.rs (target/release/deps/adversarial-2db391451680ffca)339340running 10 tests341test check_id_garbage ... ok342test add_edge_adversarial ... ok343test del_edge_adversarial ... ok344test key_msgs_adversarial ... ok345test misc_msgs_adversarial ... ok346test request_peek_garbage ... ok347test subnet_adversarial ... ok348test subnet_msg_adversarial ... ok349test arbitrary_bytes_never_panic ... ok350test arbitrary_tokens_never_panic ... ok351352test result: ok. 10 passed; 0 failed; 0 ignored; 0 measured; 0 filtered out; finished in 0.08s353354 Running tests/roundtrip.rs (target/release/deps/roundtrip-b3fb150478161852)355356running 11 tests357test mac_never_parses_as_v6 ... ok358test subnet_fits_buffer ... ok359test v6_display_never_macish ... ok360test subnet_roundtrip ... ok361test subnet_canonical ... ok362test mtu_info ... ok363test del_edge ... ok364test req_key ... ok365test udp_info ... ok366test add_edge ... ok367test ans_key ... ok368369test result: ok. 11 passed; 0 failed; 0 ignored; 0 measured; 0 filtered out; finished in 0.05s370371 Running unittests src/lib.rs (target/release/deps/tinc_sptps-0572d3c89e28bbfe)372373running 1 test374test state::tests::output_debug_redacts_payload_bytes ... ok375376test result: ok. 1 passed; 0 failed; 0 ignored; 0 measured; 0 filtered out; finished in 0.00s377378 Running tests/sptps/main.rs (target/release/deps/sptps-bca24b3c5e80ca56)379380running 38 tests381test fastpath::open_data_into_pre_handshake_is_invalid_state ... ok382test aead::aead_mismatch_fails_at_sig ... ok383test fastpath::u64_truncate_is_u32_wrap ... ok384test framing::datagram_plaintext_malformed ... ok385test framing::stream_double_kex_is_err ... ok386test framing::stream_empty_input_is_noop ... ok387test framing::datagram_encrypted_garbage ... ok388test fastpath::handle_based_seal_byte_identical ... ok389test framing::datagram_rekey_survives_malformed_handshake_record ... ok390test fastpath::open_data_into_badrecord_keeps_window ... ok391test fastpath::seal_into_open_into_roundtrip ... ok392test fastpath::open_data_into_scrubs_out_on_error ... ok393test framing::stream_hybrid_kex_passes_clamp ... ok394test hybrid::default_kex_byte_identical ... ok395test framing::stream_preauth_reclen_clamp ... ok396test framing::stream_plaintext_bad_record_types ... ok397test fastpath::alloc_seqnos_seal_with_seqno_byte_identical ... ok398test hybrid::hybrid_records_fit_meta_protocol ... ok399test hybrid::kex_mode_mismatch_is_badkex ... ok400test hybrid::hybrid_kdf_kat ... ok401test framing::stream_send_record_length_cap ... ok402test hybrid::tampered_ct_no_handshake_done ... ok403test hybrid::hybrid_roundtrip ... ok404test hybrid_confirm::no_record_before_handshake_done ... ok405test nonce_limit::alloc_seqnos_refuses_before_nonce_wrap ... ok406test nonce_limit::rekey_due_at_soft_threshold ... ok407test hybrid_confirm::send_record_refused_in_confirm ... ok408test nonce_limit::inband_datagram_rekey_rebases_key_counter ... ok409test small_order::small_order_ecdh_replayed_sig_no_panic_classical ... ok410test small_order::small_order_ecdh_replayed_sig_no_panic_hybrid ... ok411test rekey::hybrid_rekey_message_order ... ok412test aead::aes_gcm_roundtrip ... ok413test aead::aes_and_chacha_records_differ ... ok414test rekey::rekey_roundtrip_all_modes ... ok415test hybrid::handshake_latency_report ... ok416test replay_window::in_window_reorder_is_lossless ... ok417test stream_reassembly::fragmentation_transparent_initiator ... ok418test stream_reassembly::fragmentation_transparent_responder ... ok419420test result: ok. 38 passed; 0 failed; 0 ignored; 0 measured; 0 filtered out; finished in 0.09s421422 Running tests/vs_c.rs (target/release/deps/vs_c-36a1a57fc7a70f8e)423424running 6 tests425test byte_identical_wire_output ... ok426test c_initiator_rust_responder_stream ... ok427test datagram_rekey_keeps_seqno_monotone ... ok428test rust_initiator_c_responder_datagram ... ok429test rust_initiator_c_responder_stream ... ok430test stream_rekey_rust_initiator ... ok431432test result: ok. 6 passed; 0 failed; 0 ignored; 0 measured; 0 filtered out; finished in 0.01s433434 Running unittests src/lib.rs (target/release/deps/tinc_tools-98c7659423cd6299)435436running 317 tests437test cmd::config::tests::edit_file_missing ... ok438test cmd::config::tests::del_filter_no_match_fails ... ok439test cmd::config::tests::every_nonserver_var_is_host ... ok440test cmd::config::tests::del_nothing_fails ... ok441test cmd::config::tests::get_file_missing ... ok442test cmd::config::tests::add_dedup_case_insensitive ... ok443test cmd::config::tests::del_filtered ... ok444test cmd::config::tests::edit_adds_newline_before_append ... ok445test cmd::config::tests::del_removes_all ... ok446test cmd::config::tests::edit_preserves_comments ... ok447test cmd::config::tests::add_dedup_noop ... ok448test cmd::config::tests::add_appends ... ok449test cmd::config::tests::edit_preserves_pem ... ok450test cmd::config::tests::intent_dual_tagged_goes_to_tinc_conf ... ok451test cmd::config::tests::get_table ... ok452test cmd::config::tests::parse_var_expr_err ... ok453test cmd::config::tests::parse_var_expr_ok ... ok454test cmd::config::tests::intent_action_coercion ... ok455test cmd::config::tests::intent_obsolete_var_fails ... ok456test cmd::config::tests::intent_errors ... ok457test cmd::config::tests::intent_obsolete_var_get_ok ... ok458test cmd::config::tests::intent_routing ... ok459test cmd::config::tests::intent_unknown_var_force_proceeds ... ok460test cmd::config::tests::intent_unknown_var_get_proceeds ... ok461test cmd::config::tests::intent_port_is_host_only ... ok462test cmd::config::tests::get_port_with_value_skips_pidfile ... ok463test cmd::config::tests::run_full_get ... ok464test cmd::config::tests::run_full_add_subnet_to_host_file ... ok465test cmd::config::tests::run_full_get_not_found ... ok466test cmd::config::tests::run_full_explicit_node ... ok467test cmd::config::tests::run_get_port_from_pidfile ... ok468test cmd::config::tests::split_line_pem_passthrough ... ok469test cmd::config::tests::split_line_table ... ok470test cmd::config::tests::set_appends_when_absent ... ok471test cmd::config::tests::run_get_port_fallback_to_config ... ok472test cmd::ctl_simple::tests::debug_returns_prev_level ... ok473test cmd::ctl_simple::tests::disconnect_bad_name_preflight ... ok474test cmd::ctl_simple::tests::disconnect_not_found ... ok475test cmd::ctl_simple::tests::pid_from_greeting ... ok476test cmd::ctl_simple::tests::reload_daemon_fail ... ok477test cmd::ctl_simple::tests::stop_drains ... ok478test cmd::dump::tests::conn_fmt_plain_contract ... ok479test cmd::dump::tests::conn_parse_golden ... ok480test cmd::dump::tests::edge_dot_dedup_table ... ok481test cmd::dump::tests::edge_dot_weight_calc ... ok482test cmd::dump::tests::edge_fmt_plain ... ok483test cmd::dump::tests::edge_parse_golden ... ok484test cmd::dump::tests::edge_parse_unspec_local ... ok485test cmd::config::tests::run_get_port_explicit_node_skips_pidfile ... ok486test cmd::config::tests::run_full_get_overlay_host ... ok487test cmd::config::tests::set_canonicalizes_key_case ... ok488test cmd::config::tests::set_collapses_duplicates ... ok489test cmd::config::tests::run_get_with_value_is_set ... ok490test cmd::config::tests::set_warnonremove ... ok491test cmd::dump::tests::kind_err ... ok492test cmd::dump::tests::kind_needs_daemon ... ok493test cmd::dump::tests::kind_ok ... ok494test cmd::dump::tests::node_dot_color_cascade ... ok495test cmd::dump::tests::node_fmt_plain_contract ... ok496test cmd::dump::tests::node_parse_golden ... ok497test cmd::dump::tests::node_parse_host_variants ... ok498test cmd::dump::tests::node_parse_short ... ok499test cmd::dump::tests::strip_weight_table ... ok500test cmd::dump::tests::subnet_fmt_table ... ok501test cmd::dump::tests::subnet_parse_table ... ok502test cmd::edit::tests::resolve_err ... ok503test cmd::edit::tests::resolve_ok ... ok504test cmd::config::tests::tmpfile_cleaned_up_on_del_failure ... ok505test cmd::config::tests::set_replaces_in_place ... ok506test cmd::config::tests::warnonremove_case_insensitive ... ok507test cmd::dump::tests::inv_empty_cases ... ok508test cmd::dump::tests::inv_mixed ... ok509test cmd::dump::tests::inv_multiple ... ok510test cmd::edit::tests::resolve_overlay_host ... ok511test cmd::exchange::tests::export_injects_name_strips_name ... ok512test cmd::exchange::tests::get_my_name_missing_tinc_conf ... ok513test cmd::exchange::tests::export_all_skips_non_id_dirents ... ok514test cmd::exchange::tests::export_all_includes_overlay ... ok515test cmd::exchange::tests::export_preserves_pem ... ok516test cmd::exchange::tests::import_bad_name_is_error ... ok517test cmd::exchange::tests::export_all_separator_between ... ok518test cmd::exchange::tests::get_my_name_no_name_key ... ok519test cmd::exchange::tests::get_my_name_reads_config ... ok520test cmd::dump::tests::inv_roundtrip_with_invite ... ok521test cmd::exchange::tests::name_line_filter ... ok522test cmd::exchange::tests::import_no_name_at_all ... ok523test cmd::exchange::tests::import_name_format_is_exact ... ok524test cmd::dump::tests::inv_valid_table ... ok525test cmd::exchange::tests::import_junk_before_name_is_ignored ... ok526test cmd::exchange::tests::import_basic ... ok527test cmd::exchange::tests::import_skip_existing_unless_force ... ok528test cmd::exchange::tests::import_multi_with_separator ... ok529test cmd::fsck::tests::display_exhaustive ... ok530test cmd::exchange::tests::roundtrip ... ok531test cmd::fsck::tests::checks_all_hosts ... ok532test cmd::dump::tests::inv_skipped ... ok533test cmd::exchange::tests::roundtrip_multi ... ok534test cmd::fsck::tests::duplicate_multiple_ok ... ok535test cmd::fsck::tests::bad_b64_is_no_pubkey ... ok536test cmd::fsck::tests::clean_init_passes ... ok537test cmd::fsck::tests::confd_checked ... ok538test cmd::fsck::tests::duplicate_non_multiple ... ok539test cmd::fsck::tests::all_known_scripts ... ok540test cmd::fsck::tests::no_name ... ok541test cmd::fsck::tests::host_file_deleted ... ok542test cmd::fsck::tests::no_tincconf ... ok543test cmd::fsck::tests::key_mismatch ... ok544test cmd::fsck::tests::host_scripts_any_prefix ... ok545test cmd::fsck::tests::no_private_key ... ok546test cmd::fsck::tests::host_var_in_server ... ok547test cmd::fsck::tests::hosts_non_id_skipped ... ok548test cmd::fsck::tests::no_public_key ... ok549test cmd::fsck::tests::key_mismatch_force_fixes ... ok550test cmd::fsck::tests::severity_buckets ... ok551test cmd::fsck::tests::no_public_key_force_fixes ... ok552test cmd::fsck::tests::obsolete_var ... ok553test cmd::fsck::tests::non_scripts_ignored ... ok554test cmd::fsck::tests::script_not_exec_force_fixes ... ok555test cmd::fsck::tests::pem_pubkey_read ... ok556test cmd::fsck::tests::script_not_exec_warns ... ok557test cmd::fsck::tests::server_var_in_host ... ok558test cmd::fsck::tests::private_key_file_config ... ok559test cmd::fsck::tests::unknown_var_silent ... ok560test cmd::genkey::tests::disable_config_line ... ok561test cmd::genkey::tests::disable_config_line_exact_len ... ok562test cmd::genkey::tests::disable_config_line_case ... ok563test cmd::genkey::tests::disable_nonexistent ... ok564test cmd::fsck::tests::unknown_script ... ok565test cmd::genkey::tests::disable_end_type_unchecked ... ok566test cmd::genkey::tests::disable_ignores_rsa ... ok567test cmd::fsck::tests::unsafe_key_mode_force_fixes ... ok568test cmd::genkey::tests::disable_no_match ... ok569test cmd::info::tests::cascade_table ... ok570test cmd::fsck::tests::server_var_in_overlay_host ... ok571test cmd::genkey::tests::disable_pem_block_surrounded ... ok572test cmd::genkey::tests::disable_no_trailing_newline ... ok573test cmd::info::tests::localtime_zero_is_never ... ok574test cmd::info::tests::nodeinfo_format_golden ... ok575test cmd::info::tests::nodeinfo_format_unreachable ... ok576test cmd::info::tests::nodeinfo_status_order ... ok577test cmd::info::tests::nodeinfo_traffic_double_space ... ok578test cmd::info::tests::option_bits_match_connection_h ... ok579test cmd::info::tests::option_version_shifts_24 ... ok580test cmd::info::tests::localtime_epoch_is_1970ish ... ok581test cmd::info::tests::reachability_display_directup_multiline ... ok582test cmd::info::tests::localtime_shape ... ok583test cmd::info::tests::reachability_display_single_line ... ok584test cmd::info::tests::reachability_display_zero_rtt ... ok585test cmd::info::tests::status_bits_match_node_h_order ... ok586test cmd::genkey::tests::disable_space_delimited_type ... ok587test cmd::genkey::tests::disable_pem_block ... ok588test cmd::init::tests::bad_name_rejected ... ok589test cmd::genkey::tests::disable_preserves_mode ... ok590test cmd::fsck::tests::unsafe_key_mode_warns ... ok591test cmd::init::tests::eacces_on_mkdir_hints_at_dash_c ... ok592test cmd::genkey::tests::rotation_roundtrip ... ok593test cmd::genkey::tests::disable_config_line_delims ... ok594test cmd::init::tests::makedir_clamps_mode ... ok595test cmd::init::tests::reinit_fails ... ok596test cmd::init::tests::fresh_init ... ok597test cmd::invite::tests::address_basic ... ok598test cmd::invite::tests::address_with_port_on_line ... ok599test cmd::invite::tests::address_ipv6_brackets ... ok600test cmd::invite::tests::address_missing_bails ... ok601test cmd::invite::tests::address_port_from_config ... ok602test cmd::invite::tests::address_port_zero_bails ... ok603test cmd::invite::tests::invite_no_address_fails_clean ... ok604test cmd::invite::tests::copy_host_table ... ok605test cmd::invite::tests::invite_bad_name_fails ... ok606test cmd::invite::tests::invite_existing_host_fails ... ok607test cmd::invite::tests::corrupt_key_with_live_invites_not_clobbered ... ok608test cmd::invite::tests::sweep_deletes_expired ... ok609test cmd::invite::tests::mesh_vars_copied ... ok610test cmd::invite::tests::invite_existing_overlay_host_fails ... ok611test cmd::invite::tests::invite_full_flow ... ok612test cmd::join::tests::finalize_identity_rejects_bad_blob ... ok613test cmd::join::tests::finalize_bad_name ... ok614test cmd::join::tests::finalize_existing_tinc_conf ... ok615test cmd::invite::tests::sweep_filters_by_filename_length ... ok616test cmd::join::tests::finalize_identity_writes_only_the_key ... ok617test cmd::join::tests::finalize_no_name ... ok618test cmd::join::tests::finalize_force_accepts_unsafe ... ok619test cmd::invite::tests::replace_refusals ... ok620test cmd::invite::tests::second_invite_reuses_key ... ok621test cmd::join::tests::finalize_ifconfig_recognized_stubbed ... ok622test cmd::join::tests::finalize_self_clobber_detected ... ok623test cmd::join::tests::greeting_line1 ... ok624test cmd::join::tests::greeting_line2 ... ok625test cmd::join::tests::finalize_self_clobber_is_case_insensitive ... ok626test cmd::join::tests::finalize_minimal_blob ... ok627test cmd::join::tests::finalize_secondary_chunk_drops_dangerous_keys ... ok628test cmd::join::tests::split_var_forms ... ok629test cmd::join::tests::url_err ... ok630test cmd::join::tests::url_ok ... ok631test cmd::join::tests::finalize_unknown_var_dropped ... ok632test cmd::join::tests::finalize_secondary_chunks ... ok633test cmd::network::tests::list_empty ... ok634test cmd::network::tests::list_missing_confdir ... ok635test cmd::network::tests::list_anonymous_network ... ok636test cmd::join::tests::finalize_var_safe_filter ... ok637test cmd::network::tests::list_skip_no_tinc_conf ... ok638test cmd::join::tests::server_stub_single_use ... ok639test cmd::network::tests::list_skip_regular_files ... ok640test cmd::network::tests::run_switch_dot_different_advice ... ok641test cmd::network::tests::list_skip_dotted ... ok642test cmd::network::tests::run_switch_rejected ... ok643test cmd::join::tests::server_stub_recovers_file ... ok644test cmd::network::tests::list_skip_unreadable ... ok645test cmd::join::tests::url_roundtrip_with_invite ... ok646test cmd::network::tests::list_three_sorted ... ok647test cmd::sign::tests::load_host_pubkey_no_key ... ok648test cmd::sign::tests::signed_message_format ... ok649test cmd::sign::tests::binary_body_roundtrip ... ok650test cmd::sign::tests::golden_upstream_vector ... ok651test cmd::sign::tests::load_host_pubkey_pem_fallback ... ok652test cmd::sign::tests::empty_body_roundtrip ... ok653test cmd::sign::tests::signer_parse ... ok654test cmd::sign::tests::trailer_leading_space ... ok655test cmd::sign::tests::verify_malformed_header ... ok656test cmd::sign::tests::verify_header_too_long ... ok657test cmd::sign::tests::sign_verify_roundtrip ... ok658test cmd::join::tests::invite_join_roundtrip_in_process ... ok659test cmd::start::tests::find_tincd_env_override ... ok660test cmd::sign::tests::verify_any_signer ... ok661test cmd::start::tests::start_proceeds_past_missing_pidfile ... ok662test cmd::stream::tests::log_loop_color_forwarded ... ok663test cmd::stream::tests::log_loop_data_with_newline ... ok664test cmd::start::tests::start_proceeds_past_malformed_pidfile ... ok665test cmd::stream::tests::log_loop_malformed_breaks_clean ... ok666test cmd::stream::tests::log_loop_two_records ... ok667test cmd::stream::tests::parse_header_table ... ok668test cmd::stream::tests::pcap_global_header_bytes_le ... ok669test cmd::sign::tests::verify_signer_in_overlay ... ok670test cmd::stream::tests::pcap_global_header_snaplen_zero_defaults ... ok671test cmd::stream::tests::pcap_loop_snaplen_zero ... ok672test cmd::stream::tests::pcap_loop_timestamps_per_packet ... ok673test cmd::stream::tests::pcap_loop_one_packet ... ok674test cmd::sign::tests::verify_tampered_body ... ok675test cmd::stream::tests::pcap_packet_header_before_epoch_is_zero ... ok676test cmd::stream::tests::pcap_packet_header_bytes_le ... ok677test cmd::stream::tests::pcap_packet_header_y2038_truncates ... ok678test cmd::sign::tests::verify_signer_mismatch ... ok679test cmd::top::tests::counter_decrease_wraps ... ok680test cmd::top::tests::compare_table ... ok681test cmd::top::tests::display_order_is_arrival_order_not_name_order ... ok682test cmd::top::tests::departed_node_stays_dim ... ok683test cmd::top::tests::first_tick_rate_is_near_zero ... ok684test cmd::top::tests::parse_traffic_row ... ok685test cmd::top::tests::fractional_dt ... ok686test cmd::top::tests::render_clips_at_max_rows ... ok687test cmd::top::tests::render_header_no_netname ... ok688test cmd::top::tests::render_header_row0_golden ... ok689test cmd::top::tests::render_header_row2_text ... ok690test cmd::top::tests::render_row_attribute_logic ... ok691test cmd::top::tests::render_row_column_layout ... ok692test cmd::top::tests::render_row_kilo_scale ... ok693test cmd::top::tests::second_tick_rate_is_delta_over_dt ... ok694test cmd::top::tests::sort_name_is_ascending ... ok695test cmd::top::tests::render_row_cumulative ... ok696test cmd::sign::tests::verify_tampered_time ... ok697test ctl::tests::handshake_bad_line1 ... ok698test ctl::tests::ack_nonzero_result ... ok699test ctl::tests::handshake_smoke ... ok700test ctl::tests::pidfile_missing ... ok701test cmd::sign::tests::verify_tampered_signer_name ... ok702test ctl::tests::handshake_bad_cookie_eof ... ok703test ctl::tests::recv_data_after_recv_line_shared_buffer ... ok704test ctl::tests::recv_data_short_is_error ... ok705test ctl::tests::pidfile_parse ... ok706test ctl::tests::recv_ack_wrong_type ... ok707test ctl::tests::recv_lines_until_eof ... ok708test ctl::tests::pidfile_shape_enforced ... ok709test ctl::tests::recv_row_basic ... ok710test ctl::tests::pidfile_cookie_validated ... ok711test ctl::tests::recv_row_bad_code ... ok712test ctl::tests::recv_row_graph_two_terminators ... ok713test ctl::tests::recv_row_eof_mid_dump ... ok714test ctl::tests::request_from_i32 ... ok715test ctl::tests::send_int2_wire ... ok716test ctl::tests::recv_row_trailing_space_is_terminator ... ok717test ctl::tests::send_with_int_arg ... ok718test ctl::tests::send_and_ack ... ok719test ctl::tests::stop_drains_to_eof ... ok720test ctl::tests::send_with_str_arg ... ok721test idp::tests::form_parsing_decodes ... ok722test idp::tests::state_round_trips_and_query_merges ... ok723test idp::tests::authorize_errors_redirect_after_validation ... ok724test idp::tests::authorize_rejects_before_redirect_validation ... ok725test idp::tests::discovery_has_required_fields ... ok726test idp::tests::token_redirect_uri_must_match_code ... ok727test idp::tests::pkce_s256 ... ok728test keypair::tests::roundtrip_via_disk ... ok729test names::tests::check_id_charset ... ok730test idp::tests::sweep_drops_expired_state ... ok731test idp::tests::userinfo_rejects_expired_and_unknown ... ok732test names::tests::explicit_confbase_wins ... ok733test names::tests::confbase_from_netname ... ok734test names::tests::neither_given ... ok735test names::tests::replace_name_envvar_missing ... ok736test names::tests::replace_name_envvar_squashes ... ok737test names::tests::pidfile_before_resolve_panics - should panic ... ok738test keypair::tests::wrong_type_fails ... ok739test names::tests::replace_name_host_falls_through ... ok740test names::tests::replace_name_literal ... ok741test names::tests::unix_socket_case_sensitive ... ok742test names::tests::host_dirs_reads_conf_d ... ok743test names::tests::unix_socket_dot_pid_replaced ... ok744test names::tests::unix_socket_exactly_dot_pid ... ok745test names::tests::unix_socket_no_dot_pid_appended ... ok746test idp::tests::token_client_auth ... ok747test tui::tests::goto_adjusts_to_one_indexed ... ok748test names::tests::resolve_runtime_confbase_fallback ... ok749test idp::tests::code_is_single_use_and_expires ... ok750test idp::tests::full_code_flow ... ok751test cmd::invite::tests::invitation_created_hook_failure_aborts ... ok752test cmd::invite::tests::invitation_created_hook_can_edit_file ... ok753test cmd::invite::tests::replace_pins_old_key ... ok754755test result: ok. 317 passed; 0 failed; 0 ignored; 0 measured; 0 filtered out; finished in 0.70s756757 Running unittests src/bin/sptps_keypair.rs (target/release/deps/sptps_keypair-7b95ac7ae9140e8e)758759running 0 tests760761test result: ok. 0 passed; 0 failed; 0 ignored; 0 measured; 0 filtered out; finished in 0.00s762763 Running unittests src/bin/sptps_test.rs (target/release/deps/sptps_test-27cced4a217ea741)764765running 0 tests766767test result: ok. 0 passed; 0 failed; 0 ignored; 0 measured; 0 filtered out; finished in 0.00s768769 Running unittests src/bin/tinc.rs (target/release/deps/tinc-7edd1d21f893ba01)770771running 0 tests772773test result: ok. 0 passed; 0 failed; 0 ignored; 0 measured; 0 filtered out; finished in 0.00s774775 Running unittests src/bin/tinc-auth.rs (target/release/deps/tinc_auth-d828d72eecf4d692)776777running 0 tests778779test result: ok. 0 passed; 0 failed; 0 ignored; 0 measured; 0 filtered out; finished in 0.00s780781 Running tests/self_roundtrip.rs (target/release/deps/self_roundtrip-e54099193657c6c0)782783running 8 tests784test init_keys_load_in_c ... ok785test cross_stream_large_payload ... ok786test stream_large_payload ... ok787test stream ... ok788test cross_pem_private_keys ... ok789test stream_swapped_roles ... ok790test datagram ... ok791test cross_matrix ... ok792793test result: ok. 8 passed; 0 failed; 0 ignored; 0 measured; 0 filtered out; finished in 7.38s794795 Running tests/tinc_cli/main.rs (target/release/deps/tinc_cli-37ee2e87c643dcf2)796797running 71 tests798test argv::help_commands_aligned ... FAILED799test argv::glued_short_c ... ok800test argv::network_command ... ok801test argv::dispatch_errors ... ok802test argv::help_and_version_aliases ... ok803test config::config_replace_is_set ... ok804test config::get_name ... ok805test argv::netname_sources ... ok806test ctl::disconnect_validates_before_connecting ... ok807test ctl::pid_comes_from_greeting ... ok808test ctl::pidfile_malformed ... ok809test config::set_unknown_variable_needs_force ... ok810test ctl::pidfile_missing ... ok811test config::add_appends_del_removes_all ... ok812test ctl::reload_reports_daemon_error ... ok813test config::set_reloads_daemon_if_running ... ok814test dump::dump_digraph ... ok815test config::edits_pass_fsck ... ok816test dump::dump_graph_dedups_edges ... ok817test dump::dump_nodes_formats_like_c ... ok818test ctl::reload_round_trip ... ok819test dump::dump_unknown_type ... ok820test dump::dump_subnets ... ok821test dump::dump_reachable_nodes_filters ... ok822test dump::list_nodes_alias ... ok823test edit::edit_arity ... ok824test dump::dump_invitations_without_daemon ... ok825test edit::edit_rejects_path_traversal ... ok826test export_import::export_needs_tinc_conf ... ok827test export_import::export_all_then_import ... ok828test fsck::clean_init_is_silent ... ok829test export_import::import_existing_needs_force ... ok830test fsck::missing_confbase_suggests_init ... ok831test export_import::export_then_import ... ok832test genkey::generate_keys_needs_tinc_conf ... ok833test fsck::warning_exits_zero ... ok834test edit::editor_exit_status_propagates ... ok835test genkey::generate_keys_rotates ... ok836test fsck::force_fixes_missing_public_key ... ok837test info::info_address ... ok838test info::info_invalid_argument ... ok839test info::info_node ... ok840test info::info_unknown_address ... ok841test info::info_unknown_node_stops_after_nodes ... ok842test init::init_creates_confbase ... ok843test init::init_glued_config_option ... ok844test invite_join::invite_needs_name ... ok845test edit::editor_invocation_via_shell ... ok846test init::init_name_from_stdin ... ok847test invite_join::invite_records_netname ... ok848test invite_join::invite_prints_url ... ok849test invite_join::invite_without_address ... ok850test invite_join::join_identity_only_preflight ... ok851test invite_join::join_rejects_bad_url ... ok852test sign_verify::sign_verify_need_config_and_signer ... ok853test invite_join::join_with_existing_config_fails_before_connect ... ok854test top_log_pcap::log_prints_pushed_records ... ok855test top_log_pcap::log_level_forwarded ... ok856test top_log_pcap::log_rejects_garbage_level ... ok857test top_log_pcap::pcap_rejects_negative_snaplen ... ok858test top_log_pcap::pcap_writes_savefile ... ok859test top_log_pcap::top_connects_then_fails_on_non_tty ... ok860test top_log_pcap::top_too_many_args ... ok861test sign_verify::verify_on_another_node ... ok862test sign_verify::sign_verify_roundtrip ... ok863test argv::tinc_auth_glued_long_opts ... ok864test auth_http::auth_bad_requests_and_daemon_down ... ok865test auth_http::auth_by_subnet_owner ... ok866test argv::tinc_auth_sockpath_alias ... ok867test idp_http::idp_refuses_foreign_bind ... ok868test idp_http::idp_full_flow_over_http ... ok869870failures:871872---- argv::help_commands_aligned stdout ----873874thread 'argv::help_commands_aligned' (67524603) panicked at crates/tinc-tools/tests/tinc_cli/argv.rs:94:36:875no column separator in " invite [-e KEY=VAL] [--replace] NODE Generate an invitation for NODE."876note: run with `RUST_BACKTRACE=1` environment variable to display a backtrace877878879failures:880 argv::help_commands_aligned881882test result: FAILED. 70 passed; 1 failed; 0 ignored; 0 measured; 0 filtered out; finished in 0.25s883884error: test failed, to rerun pass `-p tinc-tools --test tinc_cli`