tincd-test-0.1.0
checks.x86_64-linux.tincd-test
· build #124
· raw
1tribuchet: building on jamie
unpackPhase
2unpacking source archive /nix/store/byd02mkrmzmsa32nyw2sadvsfcajlv4q-source3source root is sourcepatchPhase
4Executing configureCargoCommonVars5decompressing cargo artifacts from /nix/store/3kpvymccb3i137s7viyx9ydhnyrlpsng-tincd-deps-0.1.0/target.tar.zst to targetconfigurePhase
6will append /build/source/.cargo-home/config.toml with contents of /nix/store/70dfvqzc7s7xfnzhb29v40wfh9gl3paj-vendor-cargo-deps/config.toml7default configurePhase, nothing to dobuildPhase
8+++ command cargo --version9cargo 1.97.0 (c980f4866 2026-06-30)checkPhase
10+++ command cargo test --release --workspace11 Compiling bitflags v2.11.012 Compiling num-traits v0.2.1913 Compiling rustix v1.1.414 Compiling linux-raw-sys v0.12.115 Compiling fastrand v2.4.016 Compiling once_cell v1.21.417 Compiling zerocopy v0.8.5618 Compiling tinc-proto v0.0.0 (/build/source/crates/tinc-proto)19 Compiling tincd v0.1.0 (/build/source/crates/tincd)20 Compiling getrandom v0.3.421 Compiling wait-timeout v0.2.122 Compiling quick-error v1.2.323 Compiling bit-vec v0.8.024 Compiling fnv v1.0.725 Compiling regex-syntax v0.8.1126 Compiling unarray v0.1.427 Compiling tinc-ffi v0.0.0 (/build/source/crates/tinc-ffi)28 Compiling inout v0.2.229 Compiling hex v0.4.330 Compiling cipher v0.5.231 Compiling nix v0.31.332 Compiling netlink-packet-route v0.31.033 Compiling bit-set v0.8.034 Compiling chacha20 v0.10.235 Compiling rand_core v0.9.536 Compiling rand_xorshift v0.4.037 Compiling rand v0.9.238 Compiling module-lattice v0.2.339 Compiling crypto-bigint v0.7.540 Compiling ml-kem v0.3.241 Compiling tempfile v3.27.042 Compiling rusty-fork v0.3.143 Compiling tinc-crypto v0.0.0 (/build/source/crates/tinc-crypto)44 Compiling tinc-sptps v0.0.0 (/build/source/crates/tinc-sptps)45 Compiling tinc-conf v0.0.0 (/build/source/crates/tinc-conf)46 Compiling tinc-device v0.0.0 (/build/source/crates/tinc-device)47 Compiling crypto-primes v0.7.248 Compiling ppv-lite86 v0.2.2149 Compiling rand_chacha v0.10.050 Compiling netdev v0.46.151 Compiling rand_chacha v0.9.052 Compiling proptest v1.11.053 Compiling rsa v0.10.0-rc.1854 Compiling tinc-tools v0.0.0 (/build/source/crates/tinc-tools)55 Finished `release` profile [optimized] target(s) in 51.64s56 Running unittests src/lib.rs (target/release/deps/tinc_conf-dd4d198f151d2ac2)5758running 62 tests59test name::tests::empty_after_truncate_errors ... ok60test name::tests::envvar_same_semantics_as_host ... ok61test name::tests::host_env_beats_gethostname ... ok62test name::tests::underscore_preserved ... ok63test name::tests::literal_not_squashed ... ok64test parse::tests::entry_bool ... ok65test hostdirs::tests::no_overlay_is_plain_hosts ... ok66test parse::tests::entry_int ... ok67test parse::tests::file_bom_stripped ... ok68test parse::tests::file_crlf ... ok69test parse::tests::file_comments_and_blanks ... ok70test hostdirs::tests::overlay_equal_to_primary_is_ignored ... ok71test parse::tests::file_pem_unterminated ... ok72test parse::tests::file_non_utf8_tolerated ... ok73test parse::tests::file_skips_pem ... ok74test hostdirs::tests::dangling_symlink_occupies_name ... ok75test hostdirs::tests::names_overlay_missing_vs_unreadable ... ok76test parse::tests::line_blank_skips ... ok77test name::tests::host_truncates_at_dot_and_squashes ... ok78test parse::tests::line_empty_value_errors ... ok79test parse::tests::line_empty_variable_passes ... ok80test parse::tests::line_equals_terminates_variable ... ok81test parse::tests::line_separator_forms ... ok82test hostdirs::tests::overlay_overrides_primary ... ok83test parse::tests::line_trailing_strip ... ok84test parse::tests::line_value_with_spaces ... ok85test parse::tests::lookup_case_insensitive ... ok86test parse::tests::lookup_cmdline_first ... ok87test parse::tests::lookup_file_tiebreak ... ok88test parse::tests::lookup_line_before_file ... ok89test parse::tests::lookup_multi_ordered_by_line ... ok90test pem::tests::read_bad_b64 ... ok91test pem::tests::read_crlf ... ok92test pem::tests::public_key_file_shape ... ok93test pem::tests::read_ignores_chunking ... ok94test parse::tests::server_confd_empty ... ok95test pem::tests::read_end_type_unchecked ... ok96test pem::tests::read_empty_body_line ... ok97test parse::tests::server_confd_is_file ... ok98test parse::tests::server_confd_head_bug_not_ported ... ok99test pem::tests::read_size_short ... ok100test pem::tests::read_size_long ... ok101test parse::tests::server_no_tincconf ... ok102test parse::tests::server_confd_filter ... ok103test parse::tests::server_no_confd ... ok104test parse::tests::server_confd_merged ... ok105test parse::tests::server_confd_one_bad ... ok106test pem::tests::read_not_found ... ok107test pem::tests::read_skips_preamble ... ok108test pem::tests::read_type_prefix ... ok109test pem::tests::roundtrip_sizes ... ok110test pem::tests::write_chunking ... ok111test pem::tests::write_chunking_uneven ... ok112test vars::tests::every_entry_is_server_or_host ... ok113test vars::tests::flags_contains ... ok114test vars::tests::lookup_case_insensitive ... ok115test pem::tests::signing_key_roundtrip ... ok116test vars::tests::lookup_unknown ... ok117test vars::tests::no_duplicate_names ... ok118test vars::tests::safe_not_obsolete ... ok119test vars::tests::spot_check ... ok120test vars::tests::unsafe_paths_not_safe ... ok121122test result: ok. 62 passed; 0 failed; 0 ignored; 0 measured; 0 filtered out; finished in 0.01s123124 Running tests/roundtrip.rs (target/release/deps/roundtrip-2a515bac03bde087)125126running 3 tests127test pem_roundtrip ... ok128test line_roundtrip ... ok129test pem_skips_preamble ... ok130131test result: ok. 3 passed; 0 failed; 0 ignored; 0 measured; 0 filtered out; finished in 0.01s132133 Running unittests src/lib.rs (target/release/deps/tinc_crypto-baa09788bfe6a0a9)134135running 14 tests136test aead::tests::config_str_roundtrip ... ok137test aead::tests::default_label_suffix_empty ... ok138test invite::tests::env_key ... ok139test invite::tests::cookie_affects_filename ... ok140test invite::tests::filename_from_cookie ... ok141test invite::tests::headers ... ok142test invite::tests::key_affects_slug_prefix_only ... ok143test invite::tests::parse_bad_alphabet ... ok144test invite::tests::key_hash_via_fingerprint ... ok145test invite::tests::parse_multibyte_no_panic ... ok146test invite::tests::parse_short ... ok147test hybrid::tests::mlkem768_round_trip ... ok148test invite::tests::slug_roundtrip ... ok149test aead::tests::aes_open_into_err_leaves_out_unchanged ... ok150151test result: ok. 14 passed; 0 failed; 0 ignored; 0 measured; 0 filtered out; finished in 0.00s152153 Running tests/kat.rs (target/release/deps/kat-9af7432dd6e32f20)154155running 9 tests156test b64_encode_matches_c ... ok157test b64_decode_accepts_mixed_alphabet ... ok158test prf_matches_c ... ok159test invitation_crypto_kernel_matches_c ... ok160test sign_matches_c ... ok161test ecdh_from_seed_matches_c ... ok162test chapoly_open_rejects_tampered ... ok163test aes256gcm_known_answer ... ok164test chapoly_seal_matches_c ... ok165166test result: ok. 9 passed; 0 failed; 0 ignored; 0 measured; 0 filtered out; finished in 0.00s167168 Running unittests src/lib.rs (target/release/deps/tinc_device-0a462846e5bbcaa7)169170running 62 tests171test arena::tests::arena_is_page_aligned ... ok172test arena::tests::slot_accessors ... ok173test arena::tests::slots_within_contiguous ... ok174test bsd::tests::nibble_then_prefix_roundtrip ... ok175test bsd::tests::prefix_ipv4_is_af_inet_be ... ok176test bsd::tests::prefix_ipv6_is_libc_af_inet6_be ... ok177test bsd::tests::prefix_unknown ... ok178test arena::tests::set_len_rejects_overflow - should panic ... ok179test arena::tests::slot_oob_panics - should panic ... ok180test bsd::tests::read_eof_via_seqpacket ... ok181test bsd::tests::tap_read_ether_via_seqpacket ... ok182test bsd::tests::read_unknown_nibble_errors ... ok183test bsd::tests::tap_write_ether_via_seqpacket ... ok184test bsd::tests::tun_write_strips_ether ... ok185test bsd::tests::tun_read_ipv4_via_pipe ... ok186test bsd::tests::tun_utun_write_short_buf_errors ... ok187test bsd::tests::utun_read_ignores_prefix ... ok188test bsd::tests::utun_write_synthesizes_ipv6_prefix ... ok189test bsd::tests::utun_read_runt_errors ... ok190test bsd::tests::utun_write_synthesizes_prefix ... ok191test bsd::tests::utun_write_unknown_ethertype_errors ... ok192test ether::tests::nibble_cases ... ok193test ether::tests::set_etherheader_cases ... ok194test fd::tests::read_eof_via_pipe ... ok195test fd::tests::read_ip_via_pipe ... ok196test fd::tests::read_unknown_version_via_pipe ... ok197test fd::tests::scm_rights_round_trip ... ok198test fd::tests::write_strips_ether_via_pipe ... ok199test linux::tests::open_mq_validation ... ok200test linux::tests::open_non_root_err ... ok201test linux::tests::open_too_long_iface_err_before_open ... ok202test linux::tests::pack_ifr_name_exactly_16_err ... ok203test linux::tests::pack_ifr_name_ok ... ok204test raw::tests::open_bad_iface_errors ... ok205test raw::tests::read_eof_via_seqpacket ... ok206test raw::tests::read_ether_via_seqpacket ... ok207test raw::tests::write_ether_via_seqpacket ... ok208test tests::drain_clamps_cap_to_arena ... ok209test tests::drain_dummy_is_empty ... ok210test tests::drain_frames_until_eagain ... ok211test tests::drain_immediate_eagain_is_empty ... ok212test tests::drain_propagates_real_error ... ok213test tests::drain_respects_cap ... ok214test tso::tests::checksum_chains ... ok215test tso::tests::checksum_odd_tail ... ok216test tso::tests::checksum_rfc1071_reference ... ok217test tso::tests::gro_coalesce_three_v4 ... ok218test tso::tests::gro_flush_on_mismatch ... ok219test tso::tests::gro_reassembles_tso_split_output ... ok220test tso::tests::gro_psh_terminates ... ok221test tso::tests::gro_hits_64k_cap ... ok222test tso::tests::gro_rejects ... ok223test tso::tests::gro_short_tail_terminates ... ok224test tso::tests::gro_single_packet_zero_vnet_hdr ... ok225test tso::tests::gso_none_completes_partial_csum ... ok226test tso::tests::split_errors ... ok227test tso::tests::split_seq_wraps ... ok228test tso::tests::split_v4_even ... ok229test tso::tests::split_v4_short_tail ... ok230test tso::tests::split_v4_single_chunk ... ok231test tso::tests::split_v6_even ... ok232test tso::tests::vnet_hdr_decode ... ok233234test result: ok. 62 passed; 0 failed; 0 ignored; 0 measured; 0 filtered out; finished in 0.00s235236 Running tests/mq.rs (target/release/deps/mq-6f82f3f93c2d1d8d)237238running 2 tests239test mq_vnet_hdr_on_all_queues ... ok240test mq_one_queue_is_plain_open ... ok241242test result: ok. 2 passed; 0 failed; 0 ignored; 0 measured; 0 filtered out; finished in 0.05s243244 Running tests/utun_batch.rs (target/release/deps/utun_batch-8b041560d5300b84)245246running 0 tests247248test result: ok. 0 passed; 0 failed; 0 ignored; 0 measured; 0 filtered out; finished in 0.00s249250 Running unittests src/lib.rs (target/release/deps/tinc_ffi-97464548d0adc028)251252running 0 tests253254test result: ok. 0 passed; 0 failed; 0 ignored; 0 measured; 0 filtered out; finished in 0.00s255256 Running tests/handshake.rs (target/release/deps/handshake-792df51775edd653)257258running 6 tests259test stream_handshake ... ok260test datagram_handshake ... ok261test same_seeds_same_bytes ... ok262test stream_handshake_bytewise ... ok263test stream_rekey_uses_ack_state ... ok264test wrong_peer_key_fails_at_sig ... ok265266test result: ok. 6 passed; 0 failed; 0 ignored; 0 measured; 0 filtered out; finished in 0.01s267268 Running unittests src/lib.rs (target/release/deps/tinc_proto-f522aadc7e2e1753)269270running 59 tests271test msg::edge::tests::add_edge_bad_name_rejected ... ok272test addr::tests::rejects ... ok273test addr::tests::accepts ... ok274test msg::edge::tests::add_edge_negative_weight_clamped ... ok275test msg::edge::tests::add_edge_self_loop_rejected ... ok276test msg::edge::tests::add_edge_kat ... ok277test msg::edge::tests::add_edge_unknown_addr ... ok278test msg::edge::tests::add_edge_seven_tokens_rejected ... ok279test msg::edge::tests::add_edge_v6 ... ok280test msg::edge::tests::del_edge_kat ... ok281test msg::key::tests::ans_key_eight_fields_rejected ... ok282test msg::key::tests::ans_key ... ok283test msg::key::tests::ans_key_sptps_placeholder_fields ... ok284test msg::edge::tests::add_edge_with_local ... ok285test msg::key::tests::ans_key_with_relay_addr ... ok286test msg::key::tests::key_changed ... ok287test msg::key::tests::req_key_ext_no_payload ... ok288test msg::key::tests::req_key_ext_with_payload ... ok289test msg::key::tests::req_key_legacy ... ok290test msg::key::tests::req_key_punch_roundtrip ... ok291test msg::key::tests::req_key_reflexive_append ... ok292test msg::key::tests::req_key_unknown_reqno ... ok293test msg::misc::tests::sptps_packet ... ok294test msg::misc::tests::mtu_info ... ok295test msg::misc::tests::tcp_packet ... ok296test msg::misc::tests::udp_info ... ok297test msg::subnet::tests::kat_format ... ok298test msg::subnet::tests::kat_parse ... ok299test msg::subnet::tests::rejects ... ok300test msg::subnet::tests::roundtrip ... ok301test msg::subnet::tests::trailing_garbage_ok ... ok302test request::tests::id_roundtrip ... ok303test request::tests::peek ... ok304test subnet::tests::kat_reject ... ok305test subnet::tests::kat_roundtrip ... ok306test subnet::tests::mac_shadows_v6 ... ok307test subnet::tests::maskcheck_basics ... ok308test subnet::tests::maskcmp_byte_aligned ... ok309test subnet::tests::maskcmp_mask_equivalence ... ok310test subnet::tests::maskcmp_partial_byte ... ok311test subnet::tests::maskcmp_slash_zero ... ok312test subnet::tests::maskcmp_v6 ... ok313test subnet::tests::matches_address_mode_v4 ... ok314test subnet::tests::matches_address_mode_v6 ... ok315test subnet::tests::matches_exact_mode_v4 ... ok316test subnet::tests::matches_ignores_weight ... ok317test subnet::tests::matches_mac ... ok318test subnet::tests::matches_type_mismatch ... ok319test tests::check_id_basics ... ok320test tok::tests::basic ... ok321test tok::tests::hex_lowercase_only ... ok322test tok::tests::ld_type ... ok323test tok::tests::limits ... ok324test tok::tests::lit_match ... ok325test tok::tests::lit_mismatch ... ok326test tok::tests::lu_accepts_negative_glibc_style ... ok327test tok::tests::opt ... ok328test tok::tests::skip ... ok329test tok::tests::typed ... ok330331test result: ok. 59 passed; 0 failed; 0 ignored; 0 measured; 0 filtered out; finished in 0.01s332333 Running tests/adversarial.rs (target/release/deps/adversarial-a52b5c2efa5aca00)334335running 10 tests336test check_id_garbage ... ok337test add_edge_adversarial ... ok338test key_msgs_adversarial ... ok339test misc_msgs_adversarial ... ok340test request_peek_garbage ... ok341test del_edge_adversarial ... ok342test subnet_adversarial ... ok343test subnet_msg_adversarial ... ok344test arbitrary_bytes_never_panic ... ok345test arbitrary_tokens_never_panic ... ok346347test result: ok. 10 passed; 0 failed; 0 ignored; 0 measured; 0 filtered out; finished in 0.07s348349 Running tests/roundtrip.rs (target/release/deps/roundtrip-d73d8d352715250e)350351running 11 tests352test mac_never_parses_as_v6 ... ok353test subnet_fits_buffer ... ok354test v6_display_never_macish ... ok355test subnet_canonical ... ok356test subnet_roundtrip ... ok357test mtu_info ... ok358test del_edge ... ok359test req_key ... ok360test udp_info ... ok361test add_edge ... ok362test ans_key ... ok363364test result: ok. 11 passed; 0 failed; 0 ignored; 0 measured; 0 filtered out; finished in 0.03s365366 Running unittests src/lib.rs (target/release/deps/tinc_sptps-de857d4f9e45fc85)367368running 1 test369test state::tests::output_debug_redacts_payload_bytes ... ok370371test result: ok. 1 passed; 0 failed; 0 ignored; 0 measured; 0 filtered out; finished in 0.00s372373 Running tests/sptps/main.rs (target/release/deps/sptps-d17623edcbefa838)374375running 38 tests376test fastpath::open_data_into_pre_handshake_is_invalid_state ... ok377test framing::stream_empty_input_is_noop ... ok378test aead::aead_mismatch_fails_at_sig ... ok379test hybrid::default_kex_byte_identical ... ok380test hybrid::hybrid_records_fit_meta_protocol ... ok381test fastpath::u64_truncate_is_u32_wrap ... ok382test framing::stream_double_kex_is_err ... ok383test hybrid::kex_mode_mismatch_is_badkex ... ok384test framing::stream_preauth_reclen_clamp ... ok385test framing::stream_plaintext_bad_record_types ... ok386test aead::aes_gcm_roundtrip ... ok387test framing::datagram_plaintext_malformed ... ok388test nonce_limit::alloc_seqnos_refuses_before_nonce_wrap ... ok389test fastpath::open_data_into_badrecord_keeps_window ... ok390test nonce_limit::rekey_due_at_soft_threshold ... ok391test fastpath::seal_into_open_into_roundtrip ... ok392test framing::datagram_rekey_survives_malformed_handshake_record ... ok393test framing::datagram_encrypted_garbage ... ok394test hybrid::tampered_ct_no_handshake_done ... ok395test hybrid::hybrid_roundtrip ... ok396test fastpath::open_data_into_scrubs_out_on_error ... ok397test hybrid::hybrid_kdf_kat ... ok398test nonce_limit::inband_datagram_rekey_rebases_key_counter ... ok399test fastpath::handle_based_seal_byte_identical ... ok400test small_order::small_order_ecdh_replayed_sig_no_panic_classical ... ok401test fastpath::alloc_seqnos_seal_with_seqno_byte_identical ... ok402test small_order::small_order_ecdh_replayed_sig_no_panic_hybrid ... ok403test framing::stream_hybrid_kex_passes_clamp ... ok404test hybrid_confirm::no_record_before_handshake_done ... ok405test aead::aes_and_chacha_records_differ ... ok406test rekey::hybrid_rekey_message_order ... ok407test hybrid_confirm::send_record_refused_in_confirm ... ok408test framing::stream_send_record_length_cap ... ok409test rekey::rekey_roundtrip_all_modes ... ok410test hybrid::handshake_latency_report ... ok411test replay_window::in_window_reorder_is_lossless ... ok412test stream_reassembly::fragmentation_transparent_initiator ... ok413test stream_reassembly::fragmentation_transparent_responder ... ok414415test result: ok. 38 passed; 0 failed; 0 ignored; 0 measured; 0 filtered out; finished in 0.14s416417 Running tests/vs_c.rs (target/release/deps/vs_c-d2b235b1dfd7559f)418419running 6 tests420test c_initiator_rust_responder_stream ... ok421test rust_initiator_c_responder_stream ... ok422test rust_initiator_c_responder_datagram ... ok423test byte_identical_wire_output ... ok424test datagram_rekey_keeps_seqno_monotone ... ok425test stream_rekey_rust_initiator ... ok426427test result: ok. 6 passed; 0 failed; 0 ignored; 0 measured; 0 filtered out; finished in 0.01s428429 Running unittests src/lib.rs (target/release/deps/tinc_tools-ab5d914756d51c31)430431running 319 tests432test cmd::config::tests::edit_file_missing ... ok433test cmd::config::tests::every_nonserver_var_is_host ... ok434test cmd::config::tests::parse_var_expr_err ... ok435test cmd::config::tests::parse_var_expr_ok ... ok436test cmd::config::tests::add_dedup_case_insensitive ... ok437test cmd::config::tests::add_appends ... ok438test cmd::config::tests::add_dedup_noop ... ok439test cmd::config::tests::del_filtered ... ok440test cmd::config::tests::del_filter_no_match_fails ... ok441test cmd::config::tests::del_removes_all ... ok442test cmd::config::tests::edit_adds_newline_before_append ... ok443test cmd::config::tests::del_nothing_fails ... ok444test cmd::config::tests::edit_preserves_pem ... ok445test cmd::config::tests::edit_preserves_comments ... ok446test cmd::config::tests::intent_port_is_host_only ... ok447test cmd::config::tests::intent_obsolete_var_fails ... ok448test cmd::config::tests::intent_dual_tagged_goes_to_tinc_conf ... ok449test cmd::config::tests::intent_obsolete_var_get_ok ... ok450test cmd::config::tests::get_file_missing ... ok451test cmd::config::tests::intent_errors ... ok452test cmd::config::tests::intent_action_coercion ... ok453test cmd::config::tests::intent_routing ... ok454test cmd::config::tests::get_table ... ok455test cmd::config::tests::get_port_with_value_skips_pidfile ... ok456test cmd::config::tests::intent_unknown_var_force_proceeds ... ok457test cmd::config::tests::intent_unknown_var_get_proceeds ... ok458test cmd::config::tests::run_full_add_subnet_to_host_file ... ok459test cmd::config::tests::set_appends_when_absent ... ok460test cmd::config::tests::set_collapses_duplicates ... ok461test cmd::config::tests::set_warnonremove ... ok462test cmd::config::tests::set_replaces_in_place ... ok463test cmd::config::tests::run_full_explicit_node ... ok464test cmd::config::tests::split_line_pem_passthrough ... ok465test cmd::config::tests::run_full_get ... ok466test cmd::config::tests::run_full_get_not_found ... ok467test cmd::config::tests::split_line_table ... ok468test cmd::config::tests::set_canonicalizes_key_case ... ok469test cmd::config::tests::run_get_port_from_pidfile ... ok470test cmd::config::tests::run_get_port_fallback_to_config ... ok471test cmd::ctl_simple::tests::disconnect_bad_name_preflight ... ok472test cmd::config::tests::run_get_port_explicit_node_skips_pidfile ... ok473test cmd::config::tests::run_get_with_value_is_set ... ok474test cmd::config::tests::run_full_get_overlay_host ... ok475test cmd::config::tests::tmpfile_cleaned_up_on_del_failure ... ok476test cmd::ctl_simple::tests::disconnect_not_found ... ok477test cmd::ctl_simple::tests::pid_from_greeting ... ok478test cmd::ctl_simple::tests::debug_returns_prev_level ... ok479test cmd::ctl_simple::tests::reload_daemon_fail ... ok480test cmd::config::tests::warnonremove_case_insensitive ... ok481test cmd::dump::tests::conn_fmt_plain_contract ... ok482test cmd::dump::tests::conn_parse_golden ... ok483test cmd::dump::tests::edge_dot_weight_calc ... ok484test cmd::dump::tests::edge_dot_dedup_table ... ok485test cmd::dump::tests::edge_fmt_plain ... ok486test cmd::dump::tests::edge_parse_golden ... ok487test cmd::ctl_simple::tests::stop_drains ... ok488test cmd::dump::tests::edge_parse_unspec_local ... ok489test cmd::dump::tests::inv_dir_perms ... ok490test cmd::dump::tests::kind_err ... ok491test cmd::dump::tests::kind_needs_daemon ... ok492test cmd::dump::tests::kind_ok ... ok493test cmd::dump::tests::inv_file_perms_skip ... ok494test cmd::dump::tests::inv_empty_cases ... ok495test cmd::dump::tests::node_dot_color_cascade ... ok496test cmd::dump::tests::node_fmt_plain_contract ... ok497test cmd::dump::tests::node_parse_golden ... ok498test cmd::dump::tests::inv_mixed ... ok499test cmd::dump::tests::node_parse_host_variants ... ok500test cmd::dump::tests::inv_multiple ... ok501test cmd::dump::tests::node_parse_short ... ok502test cmd::dump::tests::strip_weight_table ... ok503test cmd::dump::tests::subnet_fmt_table ... ok504test cmd::dump::tests::subnet_parse_table ... ok505test cmd::edit::tests::resolve_err ... ok506test cmd::edit::tests::resolve_ok ... ok507test cmd::exchange::tests::name_line_filter ... ok508test cmd::edit::tests::resolve_overlay_host ... ok509test cmd::exchange::tests::get_my_name_missing_tinc_conf ... ok510test cmd::exchange::tests::export_all_separator_between ... ok511test cmd::exchange::tests::export_injects_name_strips_name ... ok512test cmd::exchange::tests::export_all_includes_overlay ... ok513test cmd::fsck::tests::display_exhaustive ... ok514test cmd::dump::tests::inv_roundtrip_with_invite ... ok515test cmd::exchange::tests::export_preserves_pem ... ok516test cmd::exchange::tests::export_all_skips_non_id_dirents ... ok517test cmd::exchange::tests::import_bad_name_is_error ... ok518test cmd::exchange::tests::import_basic ... ok519test cmd::exchange::tests::import_name_format_is_exact ... ok520test cmd::exchange::tests::get_my_name_no_name_key ... ok521test cmd::dump::tests::inv_valid_table ... ok522test cmd::exchange::tests::import_junk_before_name_is_ignored ... ok523test cmd::exchange::tests::get_my_name_reads_config ... ok524test cmd::exchange::tests::import_no_name_at_all ... ok525test cmd::exchange::tests::import_skip_existing_unless_force ... ok526test cmd::exchange::tests::import_multi_with_separator ... ok527test cmd::fsck::tests::bad_b64_is_no_pubkey ... ok528test cmd::fsck::tests::checks_all_hosts ... ok529test cmd::fsck::tests::clean_init_passes ... ok530test cmd::fsck::tests::all_known_scripts ... ok531test cmd::fsck::tests::duplicate_multiple_ok ... ok532test cmd::fsck::tests::host_file_deleted ... ok533test cmd::fsck::tests::duplicate_non_multiple ... ok534test cmd::fsck::tests::severity_buckets ... ok535test cmd::fsck::tests::confd_checked ... ok536test cmd::fsck::tests::no_name ... ok537test cmd::fsck::tests::no_tincconf ... ok538test cmd::fsck::tests::host_scripts_any_prefix ... ok539test cmd::fsck::tests::hosts_non_id_skipped ... ok540test cmd::fsck::tests::host_var_in_server ... ok541test cmd::fsck::tests::key_mismatch ... ok542test cmd::exchange::tests::roundtrip ... ok543test cmd::fsck::tests::no_private_key ... ok544test cmd::fsck::tests::no_public_key ... ok545test cmd::fsck::tests::key_mismatch_force_fixes ... ok546test cmd::exchange::tests::roundtrip_multi ... ok547test cmd::fsck::tests::obsolete_var ... ok548test cmd::fsck::tests::no_public_key_force_fixes ... ok549test cmd::fsck::tests::non_scripts_ignored ... ok550test cmd::fsck::tests::script_not_exec_force_fixes ... ok551test cmd::fsck::tests::pem_pubkey_read ... ok552test cmd::fsck::tests::script_not_exec_warns ... ok553test cmd::info::tests::cascade_table ... ok554test cmd::fsck::tests::server_var_in_host ... ok555test cmd::info::tests::localtime_epoch_is_1970ish ... ok556test cmd::genkey::tests::disable_config_line ... ok557test cmd::info::tests::localtime_shape ... ok558test cmd::info::tests::localtime_zero_is_never ... ok559test cmd::genkey::tests::disable_config_line_case ... ok560test cmd::fsck::tests::server_var_in_overlay_host ... ok561test cmd::info::tests::nodeinfo_format_golden ... ok562test cmd::genkey::tests::disable_config_line_exact_len ... ok563test cmd::info::tests::nodeinfo_format_unreachable ... ok564test cmd::genkey::tests::disable_nonexistent ... ok565test cmd::fsck::tests::unknown_script ... ok566test cmd::info::tests::nodeinfo_status_order ... ok567test cmd::genkey::tests::disable_end_type_unchecked ... ok568test cmd::info::tests::nodeinfo_traffic_double_space ... ok569test cmd::fsck::tests::unknown_var_silent ... ok570test cmd::genkey::tests::disable_ignores_rsa ... ok571test cmd::info::tests::option_bits_match_connection_h ... ok572test cmd::genkey::tests::disable_no_match ... ok573test cmd::genkey::tests::disable_no_trailing_newline ... ok574test cmd::info::tests::option_version_shifts_24 ... ok575test cmd::fsck::tests::unsafe_key_mode_warns ... ok576test cmd::info::tests::reachability_display_directup_multiline ... ok577test cmd::dump::tests::inv_skipped ... ok578test cmd::info::tests::reachability_display_single_line ... ok579test cmd::genkey::tests::disable_pem_block ... ok580test cmd::genkey::tests::disable_pem_block_surrounded ... ok581test cmd::info::tests::reachability_display_zero_rtt ... ok582test cmd::info::tests::status_bits_match_node_h_order ... ok583test cmd::genkey::tests::disable_preserves_mode ... ok584test cmd::genkey::tests::disable_space_delimited_type ... ok585test cmd::genkey::tests::rotation_roundtrip ... ok586test cmd::init::tests::bad_name_rejected ... ok587test cmd::fsck::tests::unsafe_key_mode_force_fixes ... ok588test cmd::init::tests::eacces_on_mkdir_hints_at_dash_c ... ok589test cmd::fsck::tests::private_key_file_config ... ok590test cmd::init::tests::makedir_clamps_mode ... ok591test cmd::init::tests::reinit_fails ... ok592test cmd::invite::tests::address_basic ... ok593test cmd::invite::tests::address_missing_bails ... ok594test cmd::invite::tests::address_ipv6_brackets ... ok595test cmd::invite::tests::address_port_from_config ... ok596test cmd::invite::tests::address_port_zero_bails ... ok597test cmd::invite::tests::address_with_port_on_line ... ok598test cmd::invite::tests::invite_bad_name_fails ... ok599test cmd::invite::tests::invite_existing_host_fails ... ok600test cmd::genkey::tests::disable_config_line_delims ... ok601test cmd::invite::tests::corrupt_key_with_live_invites_not_clobbered ... ok602test cmd::invite::tests::sweep_deletes_expired ... ok603test cmd::invite::tests::invite_no_address_fails_clean ... ok604test cmd::invite::tests::invite_existing_overlay_host_fails ... ok605test cmd::join::tests::finalize_bad_name ... ok606test cmd::join::tests::greeting_line1 ... ok607test cmd::invite::tests::sweep_filters_by_filename_length ... ok608test cmd::join::tests::finalize_existing_tinc_conf ... ok609test cmd::join::tests::greeting_line2 ... ok610test cmd::invite::tests::invite_full_flow ... ok611test cmd::invite::tests::invitation_created_hook_failure_aborts ... ok612test cmd::invite::tests::replace_refusals ... ok613test cmd::invite::tests::invitation_created_hook_can_edit_file ... ok614test cmd::invite::tests::mesh_vars_copied ... ok615test cmd::join::tests::split_var_forms ... ok616test cmd::join::tests::finalize_identity_writes_only_the_key ... ok617test cmd::join::tests::finalize_identity_rejects_bad_blob ... ok618test cmd::join::tests::url_err ... ok619test cmd::join::tests::url_ok ... ok620test cmd::network::tests::list_missing_confdir ... ok621test cmd::invite::tests::second_invite_reuses_key ... ok622test cmd::join::tests::finalize_force_accepts_unsafe ... ok623test cmd::join::tests::finalize_no_name ... ok624test cmd::network::tests::run_switch_dot_different_advice ... ok625test cmd::join::tests::finalize_ifconfig_recognized_stubbed ... ok626test cmd::join::tests::finalize_minimal_blob ... ok627test cmd::network::tests::run_switch_rejected ... ok628test cmd::invite::tests::replace_pins_old_key ... ok629test cmd::init::tests::fresh_init ... ok630test cmd::join::tests::finalize_secondary_chunk_drops_dangerous_keys ... ok631test cmd::sign::tests::signed_message_format ... ok632test cmd::join::tests::finalize_self_clobber_is_case_insensitive ... ok633test cmd::join::tests::finalize_self_clobber_detected ... ok634test cmd::join::tests::finalize_secondary_chunks ... ok635test cmd::network::tests::list_empty ... ok636test cmd::join::tests::finalize_unknown_var_dropped ... ok637test cmd::network::tests::list_anonymous_network ... ok638test cmd::join::tests::finalize_var_safe_filter ... ok639test cmd::network::tests::list_skip_no_tinc_conf ... ok640test cmd::network::tests::list_skip_regular_files ... ok641test cmd::network::tests::list_skip_dotted ... ok642test cmd::network::tests::list_skip_unreadable ... ok643test cmd::join::tests::server_stub_recovers_file ... ok644test cmd::join::tests::server_stub_single_use ... ok645test cmd::network::tests::list_three_sorted ... ok646test cmd::join::tests::url_roundtrip_with_invite ... ok647test cmd::sign::tests::binary_body_roundtrip ... ok648test cmd::sign::tests::load_host_pubkey_no_key ... ok649test cmd::sign::tests::empty_body_roundtrip ... ok650test cmd::invite::tests::copy_host_table ... ok651test cmd::sign::tests::golden_upstream_vector ... ok652test cmd::start::tests::find_tincd_env_override ... ok653test cmd::sign::tests::load_host_pubkey_pem_fallback ... ok654test cmd::sign::tests::trailer_leading_space ... ok655test cmd::sign::tests::verify_signer_mismatch ... ok656test cmd::sign::tests::verify_signer_in_overlay ... ok657test cmd::sign::tests::verify_tampered_body ... ok658test cmd::sign::tests::verify_malformed_header ... ok659test cmd::sign::tests::verify_header_too_long ... ok660test cmd::sign::tests::verify_any_signer ... ok661test cmd::sign::tests::signer_parse ... ok662test cmd::sign::tests::sign_verify_roundtrip ... ok663test cmd::sign::tests::verify_tampered_time ... ok664test cmd::sign::tests::verify_tampered_signer_name ... ok665test cmd::stream::tests::log_loop_color_forwarded ... ok666test cmd::stream::tests::log_loop_data_with_newline ... ok667test cmd::stream::tests::log_loop_malformed_breaks_clean ... ok668test cmd::stream::tests::log_loop_two_records ... ok669test cmd::start::tests::start_proceeds_past_missing_pidfile ... ok670test cmd::stream::tests::parse_header_table ... ok671test cmd::stream::tests::pcap_global_header_bytes_le ... ok672test cmd::stream::tests::pcap_global_header_snaplen_zero_defaults ... ok673test cmd::stream::tests::pcap_loop_one_packet ... ok674test cmd::stream::tests::pcap_loop_snaplen_zero ... ok675test cmd::stream::tests::pcap_loop_timestamps_per_packet ... ok676test cmd::stream::tests::pcap_packet_header_before_epoch_is_zero ... ok677test cmd::stream::tests::pcap_packet_header_bytes_le ... ok678test cmd::stream::tests::pcap_packet_header_y2038_truncates ... ok679test cmd::top::tests::compare_table ... ok680test cmd::start::tests::start_proceeds_past_malformed_pidfile ... ok681test cmd::top::tests::counter_decrease_wraps ... ok682test cmd::top::tests::departed_node_stays_dim ... ok683test cmd::top::tests::display_order_is_arrival_order_not_name_order ... ok684test cmd::join::tests::invite_join_roundtrip_in_process ... ok685test cmd::top::tests::first_tick_rate_is_near_zero ... ok686test cmd::top::tests::fractional_dt ... ok687test cmd::top::tests::parse_traffic_row ... ok688test cmd::top::tests::render_clips_at_max_rows ... ok689test cmd::top::tests::render_header_no_netname ... ok690test cmd::top::tests::render_header_row0_golden ... ok691test cmd::top::tests::render_header_row2_text ... ok692test cmd::top::tests::render_row_attribute_logic ... ok693test cmd::top::tests::render_row_column_layout ... ok694test cmd::top::tests::render_row_cumulative ... ok695test cmd::top::tests::render_row_kilo_scale ... ok696test cmd::top::tests::second_tick_rate_is_delta_over_dt ... ok697test cmd::top::tests::sort_name_is_ascending ... ok698test ctl::tests::ack_nonzero_result ... ok699test ctl::tests::handshake_bad_line1 ... ok700test ctl::tests::pidfile_missing ... ok701test ctl::tests::handshake_smoke ... ok702test ctl::tests::handshake_bad_cookie_eof ... ok703test ctl::tests::pidfile_cookie_validated ... ok704test ctl::tests::pidfile_parse ... ok705test ctl::tests::recv_data_after_recv_line_shared_buffer ... ok706test ctl::tests::recv_data_short_is_error ... ok707test ctl::tests::pidfile_shape_enforced ... ok708test ctl::tests::recv_ack_wrong_type ... ok709test ctl::tests::recv_lines_until_eof ... ok710test ctl::tests::recv_row_bad_code ... ok711test ctl::tests::recv_row_basic ... ok712test ctl::tests::recv_row_eof_mid_dump ... ok713test ctl::tests::request_from_i32 ... ok714test ctl::tests::recv_row_trailing_space_is_terminator ... ok715test ctl::tests::recv_row_graph_two_terminators ... ok716test ctl::tests::send_int2_wire ... ok717test ctl::tests::send_and_ack ... ok718test ctl::tests::send_with_int_arg ... ok719test ctl::tests::send_with_str_arg ... ok720test ctl::tests::stop_drains_to_eof ... ok721test idp::tests::form_parsing_decodes ... ok722test names::tests::check_id_charset ... ok723test names::tests::confbase_from_netname ... ok724test names::tests::explicit_confbase_wins ... ok725test keypair::tests::roundtrip_via_disk ... ok726test names::tests::neither_given ... ok727test names::tests::replace_name_envvar_missing ... ok728test names::tests::pidfile_before_resolve_panics - should panic ... ok729test names::tests::replace_name_envvar_squashes ... ok730test names::tests::replace_name_host_falls_through ... ok731test names::tests::replace_name_literal ... ok732test keypair::tests::wrong_type_fails ... ok733test names::tests::host_dirs_reads_conf_d ... ok734test names::tests::unix_socket_case_sensitive ... ok735test names::tests::unix_socket_dot_pid_replaced ... ok736test names::tests::resolve_runtime_confbase_fallback ... ok737test names::tests::unix_socket_exactly_dot_pid ... ok738test names::tests::unix_socket_no_dot_pid_appended ... ok739test tui::tests::goto_adjusts_to_one_indexed ... ok740test idp::tests::authorize_errors_redirect_after_validation ... ok741test idp::tests::authorize_rejects_before_redirect_validation ... ok742test idp::tests::state_round_trips_and_query_merges ... ok743test idp::tests::token_redirect_uri_must_match_code ... ok744test idp::tests::discovery_has_required_fields ... ok745test idp::tests::pkce_s256 ... ok746test idp::tests::sweep_drops_expired_state ... ok747test idp::tests::full_code_flow ... ok748test idp::tests::token_client_auth ... ok749test idp::tests::userinfo_rejects_expired_and_unknown ... ok750test idp::tests::code_is_single_use_and_expires ... ok751752test result: ok. 319 passed; 0 failed; 0 ignored; 0 measured; 0 filtered out; finished in 0.11s753754 Running unittests src/bin/sptps_keypair.rs (target/release/deps/sptps_keypair-957b369bae9c50a8)755756running 0 tests757758test result: ok. 0 passed; 0 failed; 0 ignored; 0 measured; 0 filtered out; finished in 0.00s759760 Running unittests src/bin/sptps_test.rs (target/release/deps/sptps_test-38d03da734b380bb)761762running 0 tests763764test result: ok. 0 passed; 0 failed; 0 ignored; 0 measured; 0 filtered out; finished in 0.00s765766 Running unittests src/bin/tinc.rs (target/release/deps/tinc-9d2a4c9bb63ae9f1)767768running 0 tests769770test result: ok. 0 passed; 0 failed; 0 ignored; 0 measured; 0 filtered out; finished in 0.00s771772 Running unittests src/bin/tinc-auth.rs (target/release/deps/tinc_auth-9d71665f5b023344)773774running 0 tests775776test result: ok. 0 passed; 0 failed; 0 ignored; 0 measured; 0 filtered out; finished in 0.00s777778 Running tests/self_roundtrip.rs (target/release/deps/self_roundtrip-4acb78047731e373)779780running 8 tests781test init_keys_load_in_c ... ok782test stream_large_payload ... ok783test stream ... ok784test cross_pem_private_keys ... ok785test cross_stream_large_payload ... ok786test stream_swapped_roles ... ok787test datagram ... ok788test cross_matrix ... ok789790test result: ok. 8 passed; 0 failed; 0 ignored; 0 measured; 0 filtered out; finished in 6.13s791792 Running tests/tinc_cli/main.rs (target/release/deps/tinc_cli-583e4e657c5f8379)793794running 71 tests795test argv::tinc_auth_glued_long_opts ... ok796test argv::help_commands_aligned ... FAILED797test argv::tinc_auth_sockpath_alias ... ok798test dump::dump_digraph ... ok799test dump::dump_graph_dedups_edges ... ok800test ctl::reload_round_trip ... ok801test ctl::disconnect_validates_before_connecting ... ok802test ctl::pidfile_malformed ... ok803test auth_http::auth_bad_requests_and_daemon_down ... ok804test config::set_unknown_variable_needs_force ... ok805test argv::network_command ... ok806test argv::glued_short_c ... ok807test ctl::pid_comes_from_greeting ... ok808test dump::list_nodes_alias ... ok809test ctl::reload_reports_daemon_error ... ok810test dump::dump_reachable_nodes_filters ... ok811test config::config_replace_is_set ... ok812test export_import::export_needs_tinc_conf ... ok813test config::set_reloads_daemon_if_running ... ok814test auth_http::auth_by_subnet_owner ... ok815test edit::edit_arity ... ok816test argv::dispatch_errors ... ok817test dump::dump_invitations_without_daemon ... ok818test fsck::missing_confbase_suggests_init ... ok819test config::add_appends_del_removes_all ... ok820test genkey::generate_keys_needs_tinc_conf ... ok821test info::info_invalid_argument ... ok822test info::info_address ... ok823test fsck::clean_init_is_silent ... ok824test fsck::warning_exits_zero ... ok825test genkey::generate_keys_rotates ... ok826test info::info_unknown_address ... ok827test info::info_unknown_node_stops_after_nodes ... ok828test info::info_node ... ok829test edit::editor_exit_status_propagates ... ok830test export_import::import_existing_needs_force ... ok831test init::init_glued_config_option ... ok832test init::init_creates_confbase ... ok833test invite_join::invite_needs_name ... ok834test export_import::export_then_import ... ok835test fsck::force_fixes_missing_public_key ... ok836test init::init_name_from_stdin ... ok837test invite_join::join_rejects_bad_url ... ok838test invite_join::invite_without_address ... ok839test invite_join::invite_records_netname ... ok840test sign_verify::sign_verify_need_config_and_signer ... ok841test top_log_pcap::log_level_forwarded ... ok842test top_log_pcap::log_prints_pushed_records ... ok843test idp_http::idp_refuses_foreign_bind ... ok844test top_log_pcap::log_rejects_garbage_level ... ok845test top_log_pcap::pcap_rejects_negative_snaplen ... ok846test invite_join::invite_prints_url ... ok847test invite_join::join_identity_only_preflight ... ok848test top_log_pcap::pcap_writes_savefile ... ok849test top_log_pcap::top_too_many_args ... ok850test config::get_name ... ok851test top_log_pcap::top_connects_then_fails_on_non_tty ... ok852test invite_join::join_with_existing_config_fails_before_connect ... ok853test dump::dump_subnets ... ok854test dump::dump_nodes_formats_like_c ... ok855test dump::dump_unknown_type ... ok856test ctl::pidfile_missing ... ok857test edit::edit_rejects_path_traversal ... ok858test argv::netname_sources ... ok859test argv::help_and_version_aliases ... ok860test export_import::export_all_then_import ... ok861test sign_verify::sign_verify_roundtrip ... ok862test config::edits_pass_fsck ... ok863test edit::editor_invocation_via_shell ... ok864test sign_verify::verify_on_another_node ... ok865test idp_http::idp_full_flow_over_http ... ok866867failures:868869---- argv::help_commands_aligned stdout ----870871thread 'argv::help_commands_aligned' (9372) panicked at crates/tinc-tools/tests/tinc_cli/argv.rs:94:36:872no column separator in " invite [-e KEY=VAL] [--replace] NODE Generate an invitation for NODE."873note: run with `RUST_BACKTRACE=1` environment variable to display a backtrace874875876failures:877 argv::help_commands_aligned878879test result: FAILED. 70 passed; 1 failed; 0 ignored; 0 measured; 0 filtered out; finished in 0.12s880881error: test failed, to rerun pass `-p tinc-tools --test tinc_cli`