setup
checks.aarch64-darwin.tincd-test
· build #127
· raw
1this derivation will be built:2 /nix/store/mnsnrw8cvb7c0ppprf0v0salym66nqzp-tincd-test-0.1.0.drv3error: build of '/nix/store/mnsnrw8cvb7c0ppprf0v0salym66nqzp-tincd-test-0.1.0.drv' on 'ssh-ng://customer@mac02' failed: Cannot build '/nix/store/mnsnrw8cvb7c0ppprf0v0salym66nqzp-tincd-test-0.1.0.drv'.4 Reason: builder failed with exit code 101.5 Output paths:6 /nix/store/1vdda42i20iybqddsxisiln9365mrwgx-tincd-test-0.1.07 Last 25 log lines:8 > test cli_flags::mlock_flag_locks_or_fails_loudly ... ok9 > test control::tinc_up_runs_in_confbase ... FAILED10 >11 > failures:12 >13 > ---- control::tinc_up_runs_in_confbase stdout ----14 >15 > thread 'control::tinc_up_runs_in_confbase' (67639604) panicked at crates/tincd/tests/stop/control.rs:220:5:16 > tinc-up did not run:17 > [INFO tincd] tincd 0.1.0 starting, debug level 018 > [INFO tincd] tincd starting, name=testnode19 > [INFO tincd] Device mode: Tun, interface: dummy20 > [INFO tincd::net] Listening on 0.0.0.0:5090921 > [INFO tincd] Ready22 > [INFO tincd::script] Executing script tinc-up23 >24 > note: run with `RUST_BACKTRACE=1` environment variable to display a backtrace25 >26 >27 > failures:28 > control::tinc_up_runs_in_confbase29 >30 > test result: FAILED. 35 passed; 1 failed; 0 ignored; 0 measured; 0 filtered out; finished in 7.96s31 >32 > error: test failed, to rerun pass `-p tincd --test stop`33 For full logs, run:34 nix log /nix/store/mnsnrw8cvb7c0ppprf0v0salym66nqzp-tincd-test-0.1.0.drv35error: Cannot build '/nix/store/mnsnrw8cvb7c0ppprf0v0salym66nqzp-tincd-test-0.1.0.drv'.36 Reason: builder failed with exit code 1.37 Output paths:38 /nix/store/1vdda42i20iybqddsxisiln9365mrwgx-tincd-test-0.1.0