setup
checks.aarch64-linux.tincd-test
· build #31
· raw
1these 2 derivations will be built:2 /nix/store/w5c3xanj0gnrx59yfklzlvmgza2k8ln5-tincd-deps-0.1.0.drv3 /nix/store/smw8apjzm62v7z1w04hsglz0yaphi69p-tincd-test-0.1.0.drv4Failed to find a machine for remote build!5derivation: smw8apjzm62v7z1w04hsglz0yaphi69p-tincd-test-0.1.0.drv6required (system, features): (aarch64-linux, [])71 available machines:8(systems, maxjobs, supportedFeatures, mandatoryFeatures)9([aarch64-darwin, x86_64-darwin], 8, [big-parallel, recursive-nix], [])10error: Cannot build '/nix/store/smw8apjzm62v7z1w04hsglz0yaphi69p-tincd-test-0.1.0.drv'.11 Reason: builder failed with exit code 101.12 Output paths:13 /nix/store/l2d75crz7frhabgybrybzil52yq4fk6m-tincd-test-0.1.014 Last 25 log lines:15 > test discovery::probe::tests::testnet_port_probe_roundtrip ... ok16 > test discovery::tests::testnet_first_publish_waits_for_dialable ... ok17 > test portmap::igd::tests::http_roundtrip_bounded ... ok18 > test discovery::tests::testnet_persist_roundtrip ... ok19 > test discovery::tests::testnet_publish_resolve_roundtrip_secret ... ok20 > test discovery::tests::testnet_publish_resolve_roundtrip_nosecret ... ok21 > test discovery::tests::testnet_period_rollover_fallback ... ok22 > test discovery::tests::testnet_dirty_preserved_while_publish_gated ... FAILED23 > test discovery::tests::testnet_background_resolve_roundtrip ... ok24 >25 > failures:26 >27 > ---- discovery::tests::testnet_dirty_preserved_while_publish_gated stdout ----28 >29 > thread 'discovery::tests::testnet_dirty_preserved_while_publish_gated' (13521) panicked at crates/tincd/src/discovery/mod.rs:879:50:30 > republish after gate opens31 > note: run with `RUST_BACKTRACE=1` environment variable to display a backtrace32 >33 >34 > failures:35 > discovery::tests::testnet_dirty_preserved_while_publish_gated36 >37 > test result: FAILED. 665 passed; 1 failed; 0 ignored; 0 measured; 0 filtered out; finished in 10.05s38 >39 > error: test failed, to rerun pass `-p tincd --lib`40 For full logs, run:41 nix log /nix/store/smw8apjzm62v7z1w04hsglz0yaphi69p-tincd-test-0.1.0.drv