latest build failed nix-community/harmonia
Runs
effecttrigger
context
when
push.default.uploadCodecov
build only
#644
d981af2
· 1s
15| in if hci ? onPush then builtins.mapAttrs (job: j: call ((call (j.outputs or {})).effects or {})) hci.onPush else { default = call (flake.outputs.effe …
15| in if hci ? onPush then builtins.mapAttrs (job: j: call ((call (j.outputs or {})).effects or {})) hci.onPush else { default = call (flake.outputs.effects or {}); }
16| ).default.uploadCodecov; in let d = e.run or e; in e.dependencies or d.inputDerivation or (builtins.seq d.drvPath [])
| ^
… while selecting an attribute
at «string»:16:109:
| ^
error: expected a set but found null: null
error: nix-instantiate failed with exit code 1
push.default.uploadCodecov
build only
#615
416841c
· 1s
15| in if hci ? onPush then builtins.mapAttrs (job: j: call ((call (j.outputs or {})).effects or {})) hci.onPush else { default = call (flake.outputs.effe …
15| in if hci ? onPush then builtins.mapAttrs (job: j: call ((call (j.outputs or {})).effects or {})) hci.onPush else { default = call (flake.outputs.effects or {}); }
16| ).default.uploadCodecov; in let d = e.run or e; in e.dependencies or d.inputDerivation or (builtins.seq d.drvPath [])
| ^
… while selecting an attribute
at «string»:16:109:
| ^
error: expected a set but found null: null
error: nix-instantiate failed with exit code 1
push.default.uploadCodecov
build only
#613
0d81d43
· 1s
15| in if hci ? onPush then builtins.mapAttrs (job: j: call ((call (j.outputs or {})).effects or {})) hci.onPush else { default = call (flake.outputs.effe …
15| in if hci ? onPush then builtins.mapAttrs (job: j: call ((call (j.outputs or {})).effects or {})) hci.onPush else { default = call (flake.outputs.effects or {}); }
16| ).default.uploadCodecov; in let d = e.run or e; in e.dependencies or d.inputDerivation or (builtins.seq d.drvPath [])
| ^
… while selecting an attribute
at «string»:16:109:
| ^
error: expected a set but found null: null
error: nix-instantiate failed with exit code 1
push.default.uploadCodecov
build only
#588
4848fbe
· 1s
15| in if hci ? onPush then builtins.mapAttrs (job: j: call ((call (j.outputs or {})).effects or {})) hci.onPush else { default = call (flake.outputs.effe …
15| in if hci ? onPush then builtins.mapAttrs (job: j: call ((call (j.outputs or {})).effects or {})) hci.onPush else { default = call (flake.outputs.effects or {}); }
16| ).default.uploadCodecov; in let d = e.run or e; in e.dependencies or d.inputDerivation or (builtins.seq d.drvPath [])
| ^
… while selecting an attribute
at «string»:16:109:
| ^
error: expected a set but found null: null
error: nix-instantiate failed with exit code 1
push.default.uploadCodecov
build only
#587
a3c4ad1
· 1s
15| in if hci ? onPush then builtins.mapAttrs (job: j: call ((call (j.outputs or {})).effects or {})) hci.onPush else { default = call (flake.outputs.effe …
15| in if hci ? onPush then builtins.mapAttrs (job: j: call ((call (j.outputs or {})).effects or {})) hci.onPush else { default = call (flake.outputs.effects or {}); }
16| ).default.uploadCodecov; in let d = e.run or e; in e.dependencies or d.inputDerivation or (builtins.seq d.drvPath [])
| ^
… while selecting an attribute
at «string»:16:109:
| ^
error: expected a set but found null: null
error: nix-instantiate failed with exit code 1
default.uploadCodecov
push
#567
b8e55b2
· 13s
headers=headers, File "/nix/store/7zj28la7nvb4x5fkh0a1dzpahbsw5hcg-codecov-cli-11.2.8/lib/python3.14/site-packages/codecov_cli/helpers/request.py", line 82, in …
headers=headers,
File "/nix/store/7zj28la7nvb4x5fkh0a1dzpahbsw5hcg-codecov-cli-11.2.8/lib/python3.14/site-packages/codecov_cli/helpers/request.py", line 82, in wrapper
raise Exception(f"Request failed after too many retries. URL: {kwargs.get('url', args[0] if args else 'Unknown')}")
Exception: Request failed after too many retries. URL: https://ingest.codecov.io/upload/github/nix-community::::harmonia/commits
Sentry is attempting to send 3 pending events
Waiting up to 2 seconds
Press Ctrl-C to quit
error: nix failed with exit code 1
default.uploadCodecov
push
#566
636fc34
· 13s
return send_post_request( url=url, data=data, headers=headers, File "/nix/store/7zj28la7nvb4x5fkh0a1dzpahbsw5hcg-codecov-cli-11.2.8/lib/python3.14/site-packages …
return send_post_request(
url=url,
data=data,
headers=headers,
File "/nix/store/7zj28la7nvb4x5fkh0a1dzpahbsw5hcg-codecov-cli-11.2.8/lib/python3.14/site-packages/codecov_cli/helpers/request.py", line 82, in wrapper
raise Exception(f"Request failed after too many retries. URL: {kwargs.get('url', args[0] if args else 'Unknown')}")
Exception: Request failed after too many retries. URL: https://ingest.codecov.io/upload/github/nix-community::::harmonia/commits
error: nix failed with exit code 1
push.default.uploadCodecov
build only
#565
be40076
· 2m 45s
> stderr ─── > Error: Custom { kind: Other, error: Io { context: "Failed to bind server", source: Os { code: 98, kind: AddrInUse, message: "Address alread …
> stderr ───
> Error: Custom { kind: Other, error: Io { context: "Failed to bind server", source: Os { code: 98, kind: AddrInUse, message: "Address already in use" } } }
> Error: "Timeout waiting for service (PID 8345) on 127.0.0.1:39271 after 30s"
> Cancelling due to test failure:
> ────────────
> Summary [ 30.366s] 2402 tests run: 2401 passed (59 leaky), 1 failed, 0 skipped
> FAIL [ 30.356s] (2402/2402) harmonia-cache::prometheus test_prometheus_metrics
> error: test run failed
Reason: 1 dependency failed.
default.uploadCodecov
push
#564
29978e6
· 13s
return send_post_request( url=url, data=data, headers=headers, File "/nix/store/7zj28la7nvb4x5fkh0a1dzpahbsw5hcg-codecov-cli-11.2.8/lib/python3.14/site-packages …
return send_post_request(
url=url,
data=data,
headers=headers,
File "/nix/store/7zj28la7nvb4x5fkh0a1dzpahbsw5hcg-codecov-cli-11.2.8/lib/python3.14/site-packages/codecov_cli/helpers/request.py", line 82, in wrapper
raise Exception(f"Request failed after too many retries. URL: {kwargs.get('url', args[0] if args else 'Unknown')}")
Exception: Request failed after too many retries. URL: https://ingest.codecov.io/upload/github/nix-community::::harmonia/commits
error: nix failed with exit code 1
default.uploadCodecov
push
#562
74a85f1
· 13s
return send_post_request( url=url, data=data, headers=headers, File "/nix/store/7zj28la7nvb4x5fkh0a1dzpahbsw5hcg-codecov-cli-11.2.8/lib/python3.14/site-packages …
return send_post_request(
url=url,
data=data,
headers=headers,
File "/nix/store/7zj28la7nvb4x5fkh0a1dzpahbsw5hcg-codecov-cli-11.2.8/lib/python3.14/site-packages/codecov_cli/helpers/request.py", line 82, in wrapper
raise Exception(f"Request failed after too many retries. URL: {kwargs.get('url', args[0] if args else 'Unknown')}")
Exception: Request failed after too many retries. URL: https://ingest.codecov.io/upload/github/nix-community::::harmonia/commits
error: nix failed with exit code 1
push.default.uploadCodecov
build only
#555
c9e30b9
· 0s
15| in if hci ? onPush then builtins.mapAttrs (job: j: call ((call (j.outputs or {})).effects or {})) hci.onPush else { default = call (flake.outputs.effe …
15| in if hci ? onPush then builtins.mapAttrs (job: j: call ((call (j.outputs or {})).effects or {})) hci.onPush else { default = call (flake.outputs.effects or {}); }
16| ).default.uploadCodecov; in let d = e.run or e; in e.dependencies or d.inputDerivation or (builtins.seq d.drvPath [])
| ^
… while selecting an attribute
at «string»:16:109:
| ^
error: expected a set but found null: null
error: nix-instantiate failed with exit code 1
push.default.uploadCodecov
build only
#538
3bdbdb7
· 1s
15| in if hci ? onPush then builtins.mapAttrs (job: j: call ((call (j.outputs or {})).effects or {})) hci.onPush else { default = call (flake.outputs.effe …
15| in if hci ? onPush then builtins.mapAttrs (job: j: call ((call (j.outputs or {})).effects or {})) hci.onPush else { default = call (flake.outputs.effects or {}); }
16| ).default.uploadCodecov; in let d = e.run or e; in e.dependencies or d.inputDerivation or (builtins.seq d.drvPath [])
| ^
… while selecting an attribute
at «string»:16:109:
| ^
error: expected a set but found null: null
error: nix-instantiate failed with exit code 1
push.default.uploadCodecov
build only
#535
a2b9683
· 1s
15| in if hci ? onPush then builtins.mapAttrs (job: j: call ((call (j.outputs or {})).effects or {})) hci.onPush else { default = call (flake.outputs.effe …
15| in if hci ? onPush then builtins.mapAttrs (job: j: call ((call (j.outputs or {})).effects or {})) hci.onPush else { default = call (flake.outputs.effects or {}); }
16| ).default.uploadCodecov; in let d = e.run or e; in e.dependencies or d.inputDerivation or (builtins.seq d.drvPath [])
| ^
… while selecting an attribute
at «string»:16:109:
| ^
error: expected a set but found null: null
error: nix-instantiate failed with exit code 1
push.default.uploadCodecov
build only
#534
b399c60
· 1s
15| in if hci ? onPush then builtins.mapAttrs (job: j: call ((call (j.outputs or {})).effects or {})) hci.onPush else { default = call (flake.outputs.effe …
15| in if hci ? onPush then builtins.mapAttrs (job: j: call ((call (j.outputs or {})).effects or {})) hci.onPush else { default = call (flake.outputs.effects or {}); }
16| ).default.uploadCodecov; in let d = e.run or e; in e.dependencies or d.inputDerivation or (builtins.seq d.drvPath [])
| ^
… while selecting an attribute
at «string»:16:109:
| ^
error: expected a set but found null: null
error: nix-instantiate failed with exit code 1
push.default.uploadCodecov
build only
#498
5ccf2de
· 0s
15| in if hci ? onPush then builtins.mapAttrs (job: j: call ((call (j.outputs or {})).effects or {})) hci.onPush else { default = call (flake.outputs.effe …
15| in if hci ? onPush then builtins.mapAttrs (job: j: call ((call (j.outputs or {})).effects or {})) hci.onPush else { default = call (flake.outputs.effects or {}); }
16| ).default.uploadCodecov; in let d = e.run or e; in e.dependencies or d.inputDerivation or (builtins.seq d.drvPath [])
| ^
… while selecting an attribute
at «string»:16:109:
| ^
error: expected a set but found null: null
error: nix-instantiate failed with exit code 1